program: Gaussian 09
title: 000000637
version: EM64L-G09RevD.01
frameworkgroup: C1[X(C9H13N3O4)]
method: RPBEPBE
basis: SDD
operation: Freq
keyword: #p
keyword: freq=noraman
keyword: PBEPBE/SDD
title: #p freq=noraman PBEPBE/SDD
converged: YES YES NO NO
title: Mulliken charges:
elementType: O O O O N N N C C C C C C C C C H H H H H H H H H H H H H
charge: -0.334129 -0.425536 -0.437015 -0.269733 -0.204070 -0.049565 -0.622791 -0.147230 -0.478531 -0.081093 -0.011317 -0.326053 -0.070744 0.053596 -0.352341 0.189841 0.224934 0.284932 0.252743 0.277235 0.250580 0.194815 0.207855 0.346356 0.281965 0.356051 0.231354 0.340384 0.317508
chargesum: 0.00000
title: Mulliken charges with hydrogens summed into heavy atoms:
elementType: O O O O N N N C C C C C C C C C
charge: -0.334129 -0.079179 -0.080964 -0.269733 -0.204070 -0.049565 0.035101 0.077704 0.059144 0.169488 0.265918 0.076617 0.211221 0.053596 -0.120988 0.189841
polarizability: 1.85369616e+02 -1.24988242e+01 1.20167915e+02 -6.66109861e+00 1.92099878e+01 9.41343133e+01
1716.lowfreq: -11.6834 -8.3278 -7.0075 0.0004 0.0005 0.0005 5.5845 30.7982 46.0216
frequency: -9.0746 30.7788 45.9965 77.1491 90.0570 132.4659 168.2058 198.6398 211.1146 250.9764 258.4212 273.1930 334.3088 349.3740 381.0234 423.7581 432.0113 460.4481 476.3945 517.1475 525.2987 538.0210 562.7668 568.8137 589.1878 633.6264 695.1424 733.1471 748.9853 772.0071 785.9954 803.0558 900.3683 910.0295 922.0187 952.5000 966.7442 998.3330 1010.7268 1018.1747 1021.5519 1051.3860 1060.2165 1092.7129 1104.5471 1154.4947 1176.2858 1181.4125 1205.7216 1218.8743 1243.7350 1252.8895 1272.3082 1294.8172 1297.6335 1325.1643 1337.3861 1345.2594 1381.4559 1384.4118 1397.3354 1453.3831 1466.3625 1474.7460 1506.4462 1589.8071 1628.9195 1641.6618 2951.8638 2961.7661 3007.9498 3032.6025 3051.5370 3059.3966 3124.1285 3170.1794 3191.8936 3542.0735 3547.0414 3573.2745 3700.1744
redmass: 5.6850 5.5958 5.6064 4.5423 3.8011 3.3106 3.8246 7.0383 6.0228 1.4529 4.1597 3.0715 3.5526 3.7560 3.6263 2.6083 1.2428 1.2053 3.6278 3.7624 3.1746 4.4147 7.0238 1.2524 5.6766 3.9948 2.8682 6.7970 6.5677 1.8522 3.9662 3.4801 2.3525 3.0732 3.2483 1.3450 4.4801 3.8541 2.1903 2.4653 2.3025 3.3837 2.3915 2.2802 2.7102 1.4127 2.0920 1.2101 3.7613 1.2361 1.3607 1.3460 1.3116 1.4418 1.3275 1.3717 1.7844 1.2769 1.4027 1.3446 1.6586 1.0891 1.0965 4.7060 4.5978 2.3737 2.0360 8.2078 1.0684 1.0835 1.0847 1.0659 1.0853 1.0969 1.1015 1.0884 1.1000 1.0453 1.0655 1.0666 1.1045
irintensity: 5.3036 7.1376 2.2156 3.3888 2.9371 3.5928 1.3013 3.9402 3.4816 138.7654 25.1698 10.4635 2.1739 6.9410 14.4838 5.0407 149.8625 187.5919 19.0071 7.0308 2.5218 6.1557 14.0384 126.7589 5.3033 16.0763 1.4380 4.6249 13.4774 72.3470 13.5005 1.7429 51.2518 31.6426 87.2776 0.2324 84.1332 142.6894 27.3117 87.3325 13.9953 15.5957 40.7796 8.3614 24.4311 22.5496 29.2973 29.1376 9.4492 15.6198 8.3163 55.2575 43.2803 46.4841 17.9971 15.9841 93.5261 8.4198 11.2367 24.9394 25.3126 3.8132 14.8925 168.8314 99.9761 154.6321 241.7212 742.0747 27.2861 59.3371 30.3938 5.4037 7.7908 38.3982 4.9692 0.1983 6.2143 110.0945 10.4027 7.3000 38.2855
temp: 298.150 k
press: 1.00000 atm
elementType: 8 8 8 8 7 7 7 6 6 6 6 6 6 6 6 6 1 1 1 1 1 1 1 1 1 1 1 1 1
symmnumber: 1
zpe: 593474.6 jmol-1
zpe.correction: 0.226043 hartree
zpe.thermalcorrener: 0.240634 hartree
zpe.thermalcorrenthalpy: 0.241578 hartree
zpe.thermalcorrgfe: 0.183822 hartree
zpe.sumelectzpe: -814.675444 hartree
zpe.sumelectthermal: -814.660853 hartree
zpe.sumelectthermalent: -814.659908 hartree
zpe.sumelectthermalfe: -814.717664 hartree
dipole: 0.5372 2.8457 2.9082
dipole: 4.1042
quadrupole: -71.9531 -103.5684 -98.2161
quadrupole: -27.7738 -11.6392 1.3545
quadrupole: 19.2927 -12.3225 -6.9702 -27.7738 -11.6392 1.3545
hfenergy: -814.9014863 hartree
pointgroup: C01 [X(C9H13N3O4)]
dipole: 0.2467023 -1.2206058 -1.0279039 debye
polarizability: 184.8242163|13.2484918|123.7917904|7.5034054|16.7855458|91.0558373 unknown
InChI: InChI=1S/C9H13N3O4/c10-7-1-2-12(9(15)11-7)8-3-5(14)6(4-13)16-8/h1-2,5-6,8,13-14H,3-4,10H2
charge 0 multiplicity 1
29 atoms
O  1.430235 -0.686513 0.557228
O  3.251504 1.507459 -1.756853
O  3.715398 -2.323642 0.943633
O  -1.604827 2.029563 1.147017
N  -0.833974 0.045851 0.170744
N  -3.20806 0.536734 0.276456
N  -4.745839 -0.934733 -0.645267
C  2.659754 1.140292 -0.470083
C  1.156331 1.462098 -0.514948
C  2.685963 -0.389715 -0.202995
C  0.539398 0.492389 0.515325
C  3.843296 -0.894301 0.661876
C  -1.076402 -1.122054 -0.512426
C  -1.919764 0.946995 0.571005
C  -2.368404 -1.499159 -0.828906
C  -3.430489 -0.617321 -0.392383
H  3.154993 1.678933 0.366988
H  0.920421 2.509646 -0.279277
H  0.785468 1.233728 -1.530309
H  0.472675 0.948228 1.517737
H  2.649238 -0.93334 -1.167826
H  3.883771 -0.301504 1.60158
H  4.803078 -0.78684 0.125309
H  4.238993 1.502751 -1.688318
H  -0.199083 -1.727463 -0.752726
H  2.8222 -2.461106 1.353787
H  -2.562988 -2.431067 -1.36278
H  -5.460698 -0.287637 -0.316036
H  -5.010586 -1.781974 -1.139549
