program: Gaussian 09
title: 000035515
version: EM64L-G09RevD.01
frameworkgroup: C1[X(C9H9N3O2)]
method: RPBEPBE
basis: SDD
operation: Freq
keyword: #pfreq=noraman
keyword: PBEPBE/SDD
title: #p freq=noraman PBEPBE/SDD
converged: YES YES NO NO
title: Mulliken charges:
elementType: O O N N N C C C C C C C C C H H H H H H H H H
charge: -0.256662 -0.256555 -0.399707 -0.399067 -0.409142 -0.180533 0.427166 -0.349707 -0.443012 0.202134 0.202508 -0.219932 -0.218857 -0.229758 0.256398 0.346589 0.346982 0.268588 0.239428 0.364690 0.235784 0.235163 0.237501
chargesum: 0.00000
title: Mulliken charges with hydrogens summed into heavy atoms:
elementType: O O N N N C C C C C C C C C
charge: -0.256662 -0.256555 -0.053118 -0.052085 -0.044452 0.075865 0.427166 -0.081119 -0.203584 0.202134 0.202508 0.015853 0.016306 0.007744
polarizability: 1.67324075e+02 2.02236874e-01 9.52966311e+01 -3.90310237e+00 -6.43398726e-01 9.70723464e+01
1716.lowfreq: -10.3255 -0.0013 -0.0007 -0.0005 5.7410 11.9313 36.5915 66.3885 78.1337
frequency: 36.1708 66.3244 78.0825 144.6564 163.8652 216.7929 262.5789 287.6695 371.7181 404.0948 474.2255 488.7590 506.3542 524.9572 547.2131 587.1253 614.9077 619.4844 657.4039 702.4015 707.3676 741.6807 774.4104 779.4271 839.0417 860.3971 931.5348 939.9660 984.7422 989.3359 990.9404 1005.0284 1019.0467 1030.3683 1087.5167 1149.2632 1176.0560 1185.2066 1212.9879 1219.8413 1293.9926 1344.8089 1353.5924 1358.6524 1377.0816 1390.7629 1407.8570 1430.1098 1450.7769 1484.9496 1598.7918 1614.7634 1670.6525 1678.3019 2904.5037 3121.1001 3133.0922 3143.6201 3155.2423 3169.7346 3569.9729 3584.3288 3586.3556
redmass: 4.3520 5.0995 5.9701 6.8105 7.0291 5.8674 4.7467 6.0041 10.1087 2.7700 2.4537 3.8040 3.0814 1.8211 1.5456 3.5245 6.4087 6.2226 1.3580 9.0146 1.8312 3.9035 1.8305 6.2056 5.1585 1.2433 1.4151 5.8638 1.3903 3.1184 6.2464 1.3299 2.9399 2.2199 1.6000 6.0165 1.0574 1.1108 2.5417 2.0109 1.4786 1.3397 1.8575 1.5516 1.4007 4.9827 3.6985 2.3501 1.9937 2.3745 6.0534 6.1021 8.1356 4.7055 1.0839 1.0886 1.0864 1.0912 1.0963 1.1015 1.0775 1.0772 1.0795
irintensity: 0.1670 2.2464 0.1749 2.8207 0.3743 1.1703 2.4039 0.6051 24.6027 0.1659 34.6541 0.0580 59.9597 4.7956 92.5533 1.1036 0.2216 17.7892 94.5916 14.8619 41.2682 143.1284 58.3848 20.8117 0.8221 0.0425 2.2895 24.5145 0.0729 7.9051 1.0965 0.4589 4.9356 8.9668 5.3879 19.6283 0.1611 3.4523 2.8822 77.4194 6.1817 1.0712 22.1545 115.2072 50.2806 14.3456 239.3984 227.6682 41.5315 2.1800 0.2038 0.0015 545.9783 617.5046 60.1662 6.3684 0.0195 10.6332 24.9478 17.4630 90.7287 57.1075 26.2100
temp: 298.150 k
press: 1.00000 atm
elementType: 8 8 7 7 7 6 6 6 6 6 6 6 6 6 1 1 1 1 1 1 1 1 1
symmnumber: 1
zpe: 461770.4 jmol-1
zpe.correction: 0.175879 hartree
zpe.thermalcorrener: 0.187340 hartree
zpe.thermalcorrenthalpy: 0.188285 hartree
zpe.thermalcorrgfe: 0.137292 hartree
zpe.sumelectzpe: -662.106180 hartree
zpe.sumelectthermal: -662.094719 hartree
zpe.sumelectthermalent: -662.093774 hartree
zpe.sumelectthermalfe: -662.144767 hartree
dipole: 6.1153 0.0079 -1.3626
dipole: 6.2653
quadrupole: -83.3419 -97.3425 -74.6884
quadrupole: 0.0072 2.5618 -0.4032
quadrupole: 1.7824 -12.2183 10.4359 0.0072 2.5618 -0.4032
hfenergy: -662.282059 hartree
pointgroup: C01 [X(C9H9N3O2)]
dipole: 2.4001253 0.2340921 0.5104358 debye
dipolederiv: -0.8968726 0.2547428 -0.1899955 0.3701002 -0.9486364 0.3107493 -0.3180009 0.3374631 -0.574546 -0.8829973 -0.3094628 0.043547 -0.4818718 -1.1029279 0.1997371 0.0326012 0.1710661 -0.4348869 -1.4453202 0.134237 -0.1663923 0.0918482 -0.4501868 -0.0076163 -0.0271971 -0.005773 -0.4536774 -1.4429604 -0.2287264 -0.0162884 -0.1022954 -0.4510744 -0.0006809 0.0511483 -0.0013134 -0.4592293 -0.5750474 0.0098095 -0.0010828 0.0420175 -1.3608279 0.3956129 0.0744546 0.3975325 -0.5563509 0.8216367 0.0185533 0.0458913 -0.003562 0.7064147 -0.0214771 -0.0046087 -0.0213528 0.6577744 0.0660319 0.0064913 0.0095079 0.0175398 -0.1180573 0.0224524 0.0272607 0.0233546 -0.067668 -0.0554165 0.0337618 0.0847139 0.0191881 -0.1076837 0.0350662 0.0453359 0.0349405 -0.0342109 -0.0817029 -0.0292379 -0.0738298 0.0099447 -0.1118475 0.0672955 0.0257134 0.0675531 0.0336254 1.8733496 0.0461387 0.1950807 -0.0574623 1.480793 -0.6042939 0.2665527 -0.5797827 0.6460787 1.8716002 0.1033533 0.1670389 0.2260112 1.6674249 -0.3938898 0.1479456 -0.4187249 0.4626684 -0.0629777 -0.027822 -0.0712826 -0.0244946 -0.1061324 0.0922074 -0.0625704 0.0919962 0.0938562 0.006011 0.0444302 0.1117699 0.0473784 -0.1177078 0.0542185 0.1206228 0.0542182 -0.0021905 0.0955606 -0.013866 -0.0368462 -0.0163671 -0.1326245 0.0381121 -0.0438096 0.0383556 -0.0495586 -0.0316883 -0.0050882 -0.0138893 -0.0352328 -0.0686968 -0.0519921 -0.0850922 -0.0542195 -0.1755679 0.2175259 -0.004927 -0.0426213 -0.0692844 0.2150698 0.0593213 -0.0772697 0.0490578 0.2568475 0.2161412 -0.02643 -0.034034 -0.0036214 0.1810471 0.0141788 -0.1018376 0.0250207 0.2914161 0.0371399 -0.0314186 -0.079227 -0.0406944 0.126949 -0.0374484 -0.1015157 -0.0379463 0.0469441 0.0818176 0.031918 0.0809685 0.0230305 0.1194288 -0.0737066 0.0583823 -0.0735291 -0.039941 0.2684811 -0.0050917 -0.0155881 -0.0149577 0.1717728 0.0700768 -0.0397956 0.0700133 0.3144487 0.056358 0.0177767 0.0464294 0.0249586 0.1218369 -0.0822199 0.0643302 -0.082125 -0.056753 -0.0255386 -0.0349281 -0.0870657 -0.0392326 0.1358062 -0.0589784 -0.0987133 -0.0590412 0.0095534 -0.1111317 0.0157859 0.0431955 0.0170593 0.1498601 -0.026725 0.0460629 -0.0267636 0.0913675 unknown
polarizability: 167.2328201|2.1739988|95.1453812|4.1230355|0.2462191|97.3148514 unknown
InChI: InChI=1S/C9H9N3O2/c13-8-10-7(11-9(14)12-8)6-4-2-1-3-5-6/h1-5,7,10-12H
charge 0 multiplicity 1
23 atoms
O  -2.978891 2.012249 -1.115102
O  -2.932669 -2.298314 0.6516
N  -0.952889 1.121521 -0.339707
N  -0.929246 -1.082248 0.563604
N  -2.959052 -0.033296 0.036089
C  -0.258509 0.234524 0.616971
C  1.221736 0.108898 0.27421
C  1.617629 -0.38688 -0.994131
C  2.204968 0.483017 1.219141
C  -2.332281 1.113672 -0.51251
C  -2.307355 -1.223459 0.44607
C  2.987675 -0.505014 -1.309811
C  3.578054 0.363747 0.902909
C  3.970614 -0.130013 -0.361784
H  -0.352616 0.654515 1.64524
H  -0.448406 1.920361 -0.723929
H  -0.406138 -1.911565 0.84434
H  0.851083 -0.675669 -1.721904
H  1.899105 0.866736 2.200507
H  -3.973201 -0.089741 -0.075745
H  3.291262 -0.88769 -2.29023
H  4.335669 0.654505 1.638379
H  5.03396 -0.222557 -0.608508
