program: Gaussian 09
title: 000035549
version: EM64L-G09RevD.01
frameworkgroup: C1[X(C9H16N3O2PS2)]
method: RPBEPBE
basis: SDD
operation: Freq
keyword: #p
keyword: freq=noraman
keyword: PBEPBE/SDD
title: #p freq=noraman PBEPBE/SDD
converged: YES YES NO NO
title: Mulliken charges:
elementType: S S P O O N N N C C C C C C C C C H H H H H H H H H H H H H H H H
charge: 0.075573 -0.216024 0.648153 -0.448632 -0.461892 0.047072 0.044687 -0.049478 -0.205282 -0.217762 -0.332228 -0.662167 -0.651048 0.075475 0.052128 -0.748286 -0.740979 0.224311 0.244222 0.228354 0.236322 0.209991 0.237906 0.236269 0.211775 0.237164 0.232573 0.240440 0.253896 0.252160 0.247629 0.246890 0.250789
chargesum: 0.00000
title: Mulliken charges with hydrogens summed into heavy atoms:
elementType: S S P O O N N N C C C C C C C C C
charge: 0.075573 -0.216024 0.648153 -0.448632 -0.461892 0.047072 0.044687 -0.049478 0.263251 0.246914 -0.332228 0.022000 0.030464 0.075475 0.052128 -0.001790 0.004329
polarizability: 2.67017114e+02 3.34299041e+00 1.85418854e+02 -1.56884139e+01 1.44907704e+01 1.52320322e+02
1716.lowfreq: -40.8958 -14.8848 -10.2671 -7.2746 -5.5329 -0.0016 -0.0009 -0.0009 15.0678
frequency: -40.8830 -8.5972 14.3417 29.0110 32.8033 53.3573 58.2665 60.5595 70.8599 77.9720 115.6274 123.4067 145.5462 165.2258 176.6160 185.3988 197.2116 234.0725 241.6657 258.1947 275.0969 287.8162 294.9738 315.5555 384.5296 405.7071 434.3879 470.8185 537.9302 546.3435 572.8479 577.9403 615.0473 681.6939 712.6617 798.0381 808.9298 810.0105 829.4688 867.6616 890.4210 908.9447 930.3575 989.9228 1012.9395 1023.0501 1024.0639 1043.6578 1059.1506 1102.4874 1107.6937 1129.9654 1133.1372 1167.3138 1218.3930 1252.5094 1263.3811 1310.1181 1352.8408 1357.3596 1360.2679 1390.9473 1393.4478 1396.0023 1397.8336 1432.7936 1436.6394 1454.2565 1455.4665 1456.1927 1457.0280 1465.3558 1468.5071 1475.7415 1480.2638 1482.4928 1487.1450 2989.4264 2990.1526 2996.8018 2997.7222 2997.8538 2999.4232 3055.4221 3061.7091 3079.9821 3084.3354 3093.2048 3094.0371 3111.9187 3112.9234 3136.6202 3137.1692
redmass: 1.0198 3.9568 3.7145 2.5159 4.4571 3.6502 2.7956 1.0401 3.6298 2.4411 6.0258 10.4500 8.6787 5.6561 4.2223 4.3729 4.0684 1.6989 1.3751 2.0568 3.0175 4.7185 4.6139 5.5341 6.5258 13.0117 5.8499 3.6802 12.0410 6.9098 3.8629 3.7264 5.6112 6.0222 7.5339 5.1959 1.1093 1.0911 5.5207 4.8092 3.6181 11.1670 4.8177 1.7528 2.3480 2.1513 2.8191 1.6927 1.6551 2.2455 2.2064 1.4356 1.4235 4.9701 6.7725 1.1433 1.1365 6.0162 1.2624 2.4319 1.2497 1.2639 1.2779 1.2453 1.5658 1.7091 3.4729 1.0562 1.1550 1.0400 1.0734 1.1372 1.1713 1.0643 1.3205 1.5313 1.0742 1.0545 1.0546 1.0380 1.0383 1.0381 1.0392 1.1084 1.1074 1.0961 1.0942 1.0980 1.0980 1.1023 1.1022 1.1000 1.1008
irintensity: 0.6579 0.0346 0.0739 0.0356 0.2829 0.5901 2.3080 0.5348 1.8178 4.4552 6.7873 0.5422 0.3210 0.8429 3.2059 0.0623 0.0534 3.0772 0.4484 3.4953 3.4930 9.3619 12.6034 13.3018 87.9710 10.9176 2.9794 2.0943 149.9496 38.5222 2.8230 7.5458 2.8608 47.7761 71.8811 0.7278 1.3298 3.1514 66.0720 274.6391 25.9756 3.1157 1.6250 13.6168 172.1396 3.6687 10.1088 18.6608 0.8785 14.4806 1.6244 2.4376 5.8446 0.8644 254.3141 0.1969 0.4556 3.4890 11.0657 44.9941 6.9109 12.3342 83.1177 28.7948 36.8177 219.1528 464.6375 8.3487 71.3793 13.4670 34.1991 7.3762 21.0274 5.9049 58.8966 110.3909 13.4274 19.5386 25.3110 27.8825 1.1690 19.0006 1.8636 9.0161 6.9849 6.7496 8.5075 25.7021 22.8426 27.8809 31.2153 5.4664 14.1328
temp: 298.150 k
press: 1.00000 atm
elementType: 16 16 15 8 8 7 7 7 6 6 6 6 6 6 6 6 6 1 1 1 1 1 1 1 1 1 1 1 1 1 1 1 1
symmnumber: 1
zpe: 653007.8 jmol-1
zpe.correction: 0.248718 hartree
zpe.thermalcorrener: 0.269131 hartree
zpe.thermalcorrenthalpy: 0.270075 hartree
zpe.thermalcorrgfe: 0.195873 hartree
zpe.sumelectzpe: -1803.279665 hartree
zpe.sumelectthermal: -1803.259251 hartree
zpe.sumelectthermalent: -1803.258307 hartree
zpe.sumelectthermalfe: -1803.332509 hartree
dipole: -2.6426 0.8217 1.8041
dipole: 3.3035
quadrupole: -127.7748 -106.5726 -128.0508
quadrupole: 1.5838 4.1524 -6.0360
quadrupole: -6.9754 14.2268 -7.2514 1.5838 4.1524 -6.0360
hfenergy: -1803.5283822 hartree
pointgroup: C01 [X(C9H16N3O2P1S2)]
dipole: -0.9381012 0.5337061 0.7241215 debye
polarizability: 264.0336565|-15.9836227|186.9745388|-11.1627931|19.2671333|153.7480943 unknown
InChI: InChI=1S/C5H6N3S.C4H10O2PS/c1-3-6-4(2)8-5(9)7-3;1-3-5-7(8)6-4-2/h1-2H3;3-4H2,1-2H3
charge 0 multiplicity 1
33 atoms
S  0.441582 -0.682071 -1.973252
S  3.852681 -1.539042 -1.257842
P  2.16884 -0.752256 -0.362829
O  2.273465 0.754597 0.455798
O  1.449661 -1.58707 0.967206
N  -0.756192 1.064653 -0.208903
N  -2.17823 -0.575769 -1.287481
N  -3.125154 0.994223 0.297612
C  2.503449 1.987933 -0.356003
C  1.416207 -3.081616 0.915966
C  -0.973303 0.00895 -1.040802
C  2.711689 3.109306 0.65611
C  0.857409 -3.525881 2.263738
C  -1.863915 1.503946 0.475517
C  -3.242279 -0.024709 -0.615717
C  -1.671775 2.618419 1.464356
C  -4.60609 -0.595787 -0.880789
H  3.391698 1.838781 -0.999994
H  1.604071 2.156371 -0.975892
H  0.767666 -3.394674 0.075385
H  2.441924 -3.458698 0.744108
H  2.879758 4.063647 0.123482
H  1.820709 3.216503 1.297494
H  3.586052 2.90549 1.296522
H  0.800957 -4.629731 2.29497
H  1.506686 -3.184083 3.086977
H  -0.155693 -3.119712 2.422536
H  -1.334902 3.534877 0.945915
H  -2.613496 2.824339 1.992894
H  -0.881654 2.348262 2.186883
H  -4.768571 -0.711769 -1.965592
H  -4.685791 -1.604982 -0.435296
H  -5.381061 0.048953 -0.441576
