program: Gaussian 09
title: 000035516
version: EM64L-G09RevD.01
frameworkgroup: C1[X(C9H10N4O)]
method: RPBEPBE
basis: SDD
operation: Freq
keyword: #p
keyword: freq=noraman
keyword: PBEPBE/SDD
title: #p freq=noraman PBEPBE/SDD
converged: NO YES NO NO
title: Mulliken charges:
elementType: O N N N N C C C C C C C C C H H H H H H H H H H
charge: -0.266448 -0.409680 -0.101565 -0.438556 -0.631346 -0.253102 0.421288 -0.399089 -0.388614 0.196705 0.191174 -0.228864 -0.226590 -0.234681 0.247426 0.352111 0.237435 0.273728 0.329614 0.227314 0.226157 0.228973 0.310017 0.336592
chargesum: 0.00000
title: Mulliken charges with hydrogens summed into heavy atoms:
elementType: O N N N N C C C C C C C C C
charge: -0.266448 -0.057568 -0.101565 -0.108942 0.015264 -0.005676 0.421288 -0.161654 -0.114885 0.196705 0.191174 -0.001550 -0.000433 -0.005708
polarizability: 1.74205105e+02 4.49473305e+00 1.22159040e+02 1.78259600e-01 -1.11207382e+01 7.60843687e+01
1716.lowfreq: -6.9124 -0.0008 -0.0007 -0.0005 3.5390 11.4937 29.6653 63.8944 89.4743
frequency: 29.4372 63.8813 89.4719 145.1982 175.7565 231.8835 259.8660 300.0769 341.1911 348.6311 403.3641 465.8478 493.7340 513.2511 534.8449 542.3057 553.4623 586.8784 616.2767 623.2163 673.7620 705.0829 722.3844 739.6917 790.5910 838.8552 859.0906 910.2859 928.8884 964.0227 981.0552 984.6944 990.7646 1000.6554 1026.1074 1051.5331 1078.7821 1156.9496 1171.0038 1180.9302 1211.2338 1239.1318 1285.7177 1298.6656 1323.1317 1360.9506 1378.3407 1396.0958 1441.1882 1454.5361 1483.0151 1595.9826 1608.2962 1615.9096 1666.1297 1676.3812 2896.3366 3109.3098 3127.0340 3141.4132 3158.1990 3169.7210 3542.7721 3564.0541 3571.1555 3690.6552
redmass: 4.2730 4.9599 4.9916 5.9662 5.3046 5.3997 5.6676 3.9719 1.2668 3.1152 2.8365 3.6740 2.5043 3.9335 1.2743 1.7554 1.9445 1.8241 6.4173 5.8317 5.8628 2.0100 6.6344 2.5550 2.8696 4.5062 1.2454 4.0658 1.8025 3.2870 1.6090 2.2130 6.0559 1.3470 2.0973 2.4903 1.5576 2.9717 1.0671 1.1201 2.2431 1.4836 1.5091 1.7356 1.3483 2.2644 2.9223 2.7085 2.1879 3.7415 2.4195 5.8636 1.2756 6.1004 4.7348 6.4617 1.0823 1.0883 1.0864 1.0923 1.0968 1.0982 1.0455 1.0779 1.0784 1.1037
irintensity: 0.2002 1.0217 1.0709 0.3772 4.2093 6.6955 2.0397 0.3763 89.0875 11.4456 0.1933 20.3987 19.3890 30.3933 159.0602 65.0359 48.7350 180.7425 0.4158 6.5594 7.0436 37.6919 40.9116 91.3615 6.7366 15.4198 0.5422 9.7384 8.4543 6.8589 3.0607 2.9282 0.1237 0.2840 12.7240 43.9676 5.7150 5.7072 1.1558 5.5287 0.0793 29.9936 30.5313 47.7382 9.7489 141.9594 49.0787 117.3979 41.0586 107.2674 8.4933 9.7671 77.3029 4.2086 494.2422 710.6579 59.7245 10.1325 1.0680 27.5865 26.6419 13.6268 52.2911 45.4121 32.0882 31.1432
temp: 298.150 k
press: 1.00000 atm
elementType: 8 7 7 7 7 6 6 6 6 6 6 6 6 6 1 1 1 1 1 1 1 1 1 1
symmnumber: 1
zpe: 490941.8 jmol-1
zpe.correction: 0.186990 hartree
zpe.thermalcorrener: 0.198912 hartree
zpe.thermalcorrenthalpy: 0.199856 hartree
zpe.thermalcorrgfe: 0.148128 hartree
zpe.sumelectzpe: -642.207905 hartree
zpe.sumelectthermal: -642.195982 hartree
zpe.sumelectthermalent: -642.195038 hartree
zpe.sumelectthermalfe: -642.246767 hartree
dipole: 0.4095 3.0365 0.4405
dipole: 3.0955
quadrupole: -65.6013 -82.3491 -83.7218
quadrupole: 18.8488 2.1597 -8.6982
quadrupole: 11.6228 -5.1251 -6.4977 18.8488 2.1597 -8.6982
hfenergy: -642.3948945 hartree
pointgroup: C01 [X(C9H10N4O1)]
dipole: 0.1556505 -0.9580311 0.7356415 debye
dipolederiv: -0.8597329 -0.2904893 0.1523264 -0.4609429 -0.9980083 0.331869 0.1594848 0.2859155 -0.5440596 -1.4143521 -0.2357092 0.0936092 -0.0531744 -0.4825804 0.0509182 0.0512095 0.0304449 -0.4954221 -1.4595116 0.1406962 -0.2365454 0.0275262 -0.5417296 0.0719533 -0.0695278 0.1026109 -0.4266999 -0.6406815 0.0502898 -0.0573467 0.0020102 -1.0697143 0.4465893 0.1059366 0.4701821 -0.6743745 -0.8997941 0.4927916 -0.200973 0.6465852 -0.7952869 0.1809944 -0.2492872 0.1352975 -0.7630725 1.0150114 0.0092184 0.0929033 -0.0309478 0.7404619 -0.0210653 0.1281028 0.0281108 0.5003622 0.1452688 -0.0072456 -0.0236579 0.050514 -0.1072168 -0.010707 -0.0653005 -0.0063962 -0.0264834 -0.1175181 -0.0287435 -0.0449666 -0.0276052 -0.1628568 0.0023215 0.0091376 -0.0148816 0.0604338 -0.1296368 -0.0284953 0.0858735 -0.0415016 -0.0981841 -0.03728 0.0911998 -0.0154649 -0.0308741 1.6880518 0.104202 0.0015945 0.2417121 1.4671662 -0.6111166 -0.0421412 -0.629251 0.6099698 1.8068039 -0.08365 0.2120124 -0.1353216 0.9254951 -0.6317067 0.2160731 -0.6863297 0.847464 -0.0068987 -0.0417609 0.0823295 -0.0449385 -0.1360008 -0.0352771 0.1052158 -0.0392815 0.0339545 -0.035717 -0.0201852 -0.0797097 -0.0141588 -0.1440399 -0.0212336 -0.0801856 -0.0256721 0.1319742 0.0570678 -0.0540456 -0.0325916 -0.0435818 -0.1502503 -0.0082292 -0.0565626 0.0001513 -0.0544642 -0.0813677 0.0241893 -0.0040864 -0.0426793 -0.073449 -0.0401564 -0.1000187 -0.0846332 -0.1587203 0.2339629 -0.0070505 -0.0316163 0.0296183 0.1477735 0.0531451 -0.0491169 0.0713472 0.279595 0.0834645 0.0149691 0.0860838 0.0120848 0.1387647 0.0007145 0.0760453 0.0090741 -0.0877655 0.1239059 0.0222669 -0.0780334 0.0111595 0.1376073 0.0333897 -0.1153272 0.0253536 0.0339308 0.1674298 0.0043313 -0.0026333 -0.0247036 0.2035733 0.0954916 0.0016981 0.1021105 0.2875744 -0.0242635 0.0436928 -0.0951864 0.0538038 0.1434915 0.0396582 -0.1093902 0.0406986 -0.0242387 0.0478553 0.0129287 0.0621918 0.0145923 0.1476073 0.0221731 0.0876279 0.0182694 -0.1069349 -0.1271774 0.0516207 0.0503495 0.0558902 0.1496111 0.0001322 0.0515681 -0.0008644 0.0785923 0.242625 -0.1046975 -0.0220698 -0.139782 0.2484662 0.0381461 -0.130506 0.0994021 0.2581333 0.1852041 -0.0691241 -0.0098572 -0.0861588 0.309299 0.0492757 -0.0159354 0.083806 0.2711253 unknown
polarizability: 173.9664074|-7.0643048|87.438164|0.0066502|-22.4341465|111.0439427 unknown
InChI: InChI=1S/C9H10N4O/c10-8-11-7(12-9(14)13-8)6-4-2-1-3-5-6/h1-5,7,12-13H,10H2
charge 0 multiplicity 1
24 atoms
O  2.856662 2.05382 -1.328898
N  0.875032 0.879442 -0.837403
N  0.97095 -1.170467 0.503551
N  2.939409 -0.060347 -0.311155
N  3.095918 -1.778801 1.314551
C  0.238824 -0.451001 -0.555006
C  -1.22801 -0.229391 -0.187686
C  -2.160381 0.086135 -1.207017
C  -1.662752 -0.303016 1.155297
C  2.244825 1.044381 -0.878167
C  2.273211 -1.005978 0.504599
C  -3.512291 0.342467 -0.885029
C  -3.01468 -0.050283 1.478113
C  -3.941737 0.277556 0.460915
H  0.279197 -1.060457 -1.488187
H  0.296115 1.66921 -1.12532
H  -1.835453 0.119256 -2.255586
H  -0.932912 -0.578001 1.922557
H  3.957206 -0.025141 -0.381905
H  -4.227541 0.583468 -1.679321
H  -3.347187 -0.111592 2.520572
H  -4.990289 0.472336 0.713008
H  3.998346 -1.434398 1.634363
H  2.634939 -2.5096 1.852854
