program: Gaussian 09
title: 000035566
version: EM64L-G09RevD.01
frameworkgroup: C1[X(C12H15N3S3)]
method: RPBEPBE
basis: SDD
operation: Freq
keyword: #p
keyword: freq=noraman
keyword: PBEPBE/SDD
title: #p freq=noraman PBEPBE/SDD
converged: YES YES NO NO
title: Mulliken charges:
elementType: S S S N N N C C C C C C C C C C C C H H H H H H H H H H H H H H H
charge: 0.278874 0.306780 0.292986 0.071323 0.033789 0.038695 -0.336803 -0.342629 -0.312646 -0.747425 -0.749305 -0.746818 0.034407 0.035707 0.035934 -0.553325 -0.553870 -0.553305 0.265620 0.323670 0.263228 0.296389 0.263326 0.298443 0.240012 0.243850 0.244635 0.223015 0.219106 0.223569 0.219375 0.224054 0.219340
chargesum: 0.00000
title: Mulliken charges with hydrogens summed into heavy atoms:
elementType: S S S N N N C C C C C C C C C C C C
charge: 0.278874 0.306780 0.292986 0.071323 0.033789 0.038695 -0.336803 -0.342629 -0.312646 -0.158135 -0.189688 -0.185049 0.274419 0.279557 0.280569 -0.111204 -0.110927 -0.109911
polarizability: 3.62042431e+02 -1.69931434e+00 2.21651385e+02 -5.50142783e+00 -6.29489832e+00 1.28977770e+02
1716.lowfreq: -1.2923 -0.0009 0.0005 0.0015 3.0828 4.5464 20.2027 24.8011 30.4929
frequency: 20.1662 24.7648 30.4691 32.3445 39.6672 44.5472 81.5056 91.3175 95.0298 126.7679 131.8223 139.0764 152.8213 161.0118 187.6388 196.0864 242.1870 271.8571 288.5263 308.1870 370.3702 376.0938 395.7060 404.2853 441.3793 451.8178 499.4543 559.0884 560.2870 568.4192 605.6559 609.2221 699.0125 702.8234 705.0808 780.1974 785.4253 790.1670 868.2115 869.7285 887.7333 897.5888 933.8634 934.6366 942.9650 950.0434 951.2636 953.0547 1005.1709 1007.3295 1010.0544 1102.5832 1107.9594 1108.7586 1181.6545 1189.3275 1201.9468 1213.6307 1214.7082 1217.9381 1230.4406 1241.7197 1249.8371 1260.6346 1286.3029 1288.0132 1292.8959 1393.2389 1408.9074 1412.8833 1419.8877 1421.1750 1435.0553 1439.1487 1454.0308 1651.1882 1652.4945 1652.9145 3011.9949 3036.9153 3037.8615 3091.0670 3091.1390 3091.4200 3103.5437 3109.1555 3109.9165 3120.4416 3123.9044 3124.9818 3202.2789 3202.3946 3203.2492
redmass: 4.4406 4.5365 3.9182 4.2423 5.7460 5.3613 2.4474 2.3701 2.7291 8.1709 3.8538 4.2063 12.9431 9.5672 3.3768 4.1938 4.1254 2.8569 2.7340 3.1868 3.9483 4.5469 2.4978 2.3471 4.5313 9.7386 4.8458 2.4670 2.4675 2.9361 11.8883 11.7206 2.2002 2.1524 2.2211 12.1231 9.3194 11.9470 1.4941 1.5565 1.5100 7.6690 2.0319 2.0444 2.1592 1.3408 1.3259 1.3267 1.1448 1.1369 1.1405 1.5034 1.5668 1.5569 7.6668 7.7134 8.2090 1.3532 1.3622 1.3804 2.3314 1.2046 1.2391 1.9851 1.2223 1.2191 1.2168 8.2818 1.1621 1.3822 3.3331 1.1745 1.1817 1.2011 1.1338 4.5086 4.5805 4.5543 1.0607 1.0577 1.0576 1.0604 1.0603 1.0609 1.1003 1.0992 1.0991 1.0978 1.1018 1.1020 1.1146 1.1146 1.1145
irintensity: 0.4852 0.0287 0.0616 0.0292 0.7371 0.7392 1.0885 0.0522 1.1765 0.5043 0.0511 0.3572 0.1400 0.2583 0.2691 3.0326 12.6154 6.1609 1.4918 0.9563 1.9509 4.6912 3.2920 0.2291 1.5255 2.0126 6.9045 16.1311 3.0931 12.6024 0.9043 0.0045 1.9378 51.5676 26.6230 9.4764 105.7640 227.2636 23.3524 0.8979 15.9073 1.4812 4.5301 6.0445 4.5705 70.1533 74.9212 78.3625 11.3238 12.9635 9.7612 5.9564 2.1895 1.0817 285.6305 216.8487 194.1210 1.4946 21.1894 0.1502 3.7153 14.8658 4.9768 5.2289 5.6655 4.9024 0.8746 759.4017 71.9489 335.3870 985.8812 7.5198 25.6380 1.4096 14.0711 9.6106 6.6073 6.5450 45.2982 13.9888 13.7135 11.1657 9.0460 9.4217 3.1604 1.4282 0.4575 14.0938 0.2631 9.9793 0.0194 37.9549 24.1945
temp: 298.150 k
press: 1.00000 atm
elementType: 16 16 16 7 7 7 6 6 6 6 6 6 6 6 6 6 6 6 1 1 1 1 1 1 1 1 1 1 1 1 1 1 1
symmnumber: 1
zpe: 643420.2 jmol-1
zpe.correction: 0.245066 hartree
zpe.thermalcorrener: 0.266065 hartree
zpe.thermalcorrenthalpy: 0.267009 hartree
zpe.thermalcorrgfe: 0.190625 hartree
zpe.sumelectzpe: -1823.292970 hartree
zpe.sumelectthermal: -1823.271971 hartree
zpe.sumelectthermalent: -1823.271026 hartree
zpe.sumelectthermalfe: -1823.347411 hartree
dipole: -2.3875 2.5361 -0.3949
dipole: 3.5055
quadrupole: -107.9521 -136.5403 -125.5754
quadrupole: 1.5115 -2.1477 2.1099
quadrupole: 15.4039 -13.1844 -2.2195 1.5115 -2.1477 2.1099
hfenergy: -1823.5380356 hartree
pointgroup: C01 [X(C12H15N3S3)]
dipole: -0.9660237 0.9154339 -0.3617213 debye
polarizability: 360.6604877|-4.4390335|211.5539422|-18.2426831|-29.3309592|140.457157 unknown
InChI: InChI=1S/C12H15N3S3/c1-4-7-16-10-13-11(17-8-5-2)15-12(14-10)18-9-6-3/h4-6H,1-3,7-9H2
charge 0 multiplicity 1
33 atoms
S  3.379889 -1.506223 0.054544
S  -1.699857 -2.332341 1.484216
S  -0.361366 2.121667 -1.477995
N  0.775869 -1.713289 0.665745
N  1.361578 0.240914 -0.645507
N  -0.943355 -0.134225 -0.0014
C  1.672332 -0.915973 0.009593
C  -0.514117 -1.275897 0.62258
C  0.041534 0.584288 -0.614875
C  4.284547 -0.142293 -0.953906
C  -3.339813 -1.397981 1.142829
C  -2.251481 2.230465 -1.169471
C  5.278039 0.583926 -0.094153
C  -3.943066 -1.783915 -0.177383
C  -2.571621 2.881669 0.145436
C  6.621423 0.55346 -0.289956
C  -5.130876 -2.42627 -0.315114
C  -3.214298 4.070642 0.271317
H  4.754406 -0.658953 -1.805025
H  3.46487 0.510364 -1.303102
H  -3.981974 -1.660806 1.998903
H  -3.071805 -0.329994 1.178944
H  -2.632815 2.799868 -2.03239
H  -2.605133 1.187799 -1.211572
H  4.85742 1.178684 0.728328
H  -3.361822 -1.50549 -1.067106
H  -2.259577 2.327271 1.041024
H  7.305477 1.121429 0.349645
H  7.072405 -0.035902 -1.098084
H  -5.536097 -2.672916 -1.302423
H  -5.731412 -2.722185 0.554088
H  -3.440058 4.496746 1.254816
H  -3.534646 4.649458 -0.603945
