program: Gaussian 09
title: 000035512
version: EM64L-G09RevD.01
frameworkgroup: C1[X(C12H15Cl2N5)]
method: RPBEPBE
basis: SDD
operation: Freq
keyword: #p
keyword: freq=noraman
keyword: PBEPBE/SDD
title: #p freq=noraman PBEPBE/SDD
converged: YES YES NO NO
title: Mulliken charges:
elementType: Cl Cl N N N N N C C C C C C C C C C C C H H H H H H H H H H H H H H H
charge: -0.016269 -0.008141 -0.267895 -0.056883 -0.153038 -0.631627 -0.610731 -0.198506 -0.017569 -0.715669 -0.700631 0.427303 0.197691 -0.033764 -0.356940 -0.371882 -0.055067 -0.203465 -0.131645 0.238558 0.191171 0.235620 0.212193 0.223539 0.247783 0.207858 0.201739 0.304458 0.251620 0.342965 0.341694 0.257899 0.325482 0.322149
chargesum: 0.00000
title: Mulliken charges with hydrogens summed into heavy atoms:
elementType: Cl Cl N N N N N C C C C C C C C C C C C
charge: -0.016269 -0.008141 -0.267895 -0.056883 -0.153038 0.053031 0.036900 0.040052 0.173602 -0.044318 -0.043250 0.427303 0.197691 -0.033764 -0.052482 -0.120262 -0.055067 0.054434 -0.131645
polarizability: 2.84779128e+02 -1.54649793e+01 1.90701273e+02 -1.10985167e+01 -5.11470792e+00 1.15653175e+02
1716.lowfreq: -10.2490 -2.5077 -0.0009 -0.0005 0.0017 6.1690 31.3805 42.1971 54.4503
frequency: 30.8343 42.1759 54.4415 76.9532 104.3497 116.9575 139.9800 164.6945 176.6532 193.2283 202.1385 208.9510 242.0333 246.9622 259.6827 288.2064 322.4489 328.4319 352.2323 383.1668 392.8052 403.5127 422.6712 438.4745 454.2317 487.1460 494.4349 514.5015 526.1448 533.7100 575.3360 601.2006 625.0825 662.8460 674.6079 692.5856 713.9247 764.6023 788.2793 805.0095 813.1652 861.6605 883.4645 913.3635 928.2268 940.5241 958.8089 960.7074 973.2439 996.6334 1035.6881 1082.9891 1122.8314 1125.7242 1132.7101 1155.0692 1180.7349 1205.8477 1248.7188 1280.6703 1293.1073 1296.6057 1328.9038 1348.6809 1355.2809 1375.6611 1393.9180 1397.1481 1401.5207 1438.1794 1462.7719 1465.5551 1470.3521 1482.3834 1489.5132 1547.4816 1557.6282 1576.4781 1596.9720 1619.2860 1627.4476 2964.2788 2976.0638 2983.2252 2991.9365 3064.8699 3073.1207 3086.8144 3093.3459 3161.7746 3178.9505 3184.6535 3545.3394 3568.0672 3699.0902 3728.6233
redmass: 6.7774 7.2352 3.2992 4.2021 4.2265 6.1929 4.8399 6.5486 11.4924 4.6158 1.2668 4.3565 6.3045 1.2815 2.6749 3.3793 4.9354 3.2555 3.4596 3.7558 1.2226 1.3348 3.1452 4.3008 2.5014 5.2125 5.3376 1.2478 1.4621 2.0909 4.7481 3.5883 6.3242 7.2694 7.6213 3.7517 9.2254 6.9478 4.9409 1.7109 2.3723 4.2715 1.4099 1.3030 1.7459 1.3696 1.7629 1.9147 3.8313 4.4836 4.7849 1.5541 2.0126 2.2822 2.3920 1.4512 2.0298 3.2256 1.5091 1.3867 2.2210 1.4658 1.5071 2.9836 1.6860 1.2243 1.2394 4.7730 3.5964 2.9906 1.0969 2.4209 1.0788 1.0499 1.0597 3.2636 3.4656 1.5500 5.8346 2.4910 2.7055 1.0783 1.0391 1.0395 1.0836 1.0989 1.0989 1.1000 1.0993 1.0890 1.0919 1.0956 1.0447 1.0440 1.1053 1.1058
irintensity: 0.4342 0.4386 0.0727 0.0540 0.1243 0.8758 2.2667 1.0321 1.5249 1.6322 1.0428 0.7154 0.6428 1.4028 0.3960 4.8731 1.8435 6.1614 5.0645 44.6266 193.5931 107.9865 55.0851 6.1652 33.0313 73.0410 2.0861 1.1181 54.2433 44.7314 6.8877 4.4444 20.3256 11.4313 7.2318 3.7546 13.8753 22.1882 26.4596 28.9224 24.5380 49.5687 14.0258 9.4794 0.6792 1.5773 7.5052 10.3179 69.6621 16.6106 25.8754 14.2114 29.0933 35.1857 2.7889 1.6950 1.8800 10.1073 40.9138 34.4140 131.8007 3.9470 22.5742 33.4519 3.1005 24.8955 29.3484 224.5862 89.7750 218.2993 44.3183 297.0388 5.4141 16.4660 16.1816 200.5945 132.6830 97.2223 153.7184 533.5578 433.1813 39.7356 35.1217 32.5303 29.6583 33.4405 51.1254 18.0281 32.8620 2.6169 0.1675 3.5590 71.3008 99.6102 46.5427 40.9731
temp: 298.150 k
press: 1.00000 atm
elementType: 17 17 7 7 7 7 7 6 6 6 6 6 6 6 6 6 6 6 6 1 1 1 1 1 1 1 1 1 1 1 1 1 1 1
symmnumber: 1
zpe: 688638.9 jmol-1
zpe.correction: 0.262289 hartree
zpe.thermalcorrener: 0.281372 hartree
zpe.thermalcorrenthalpy: 0.282316 hartree
zpe.thermalcorrgfe: 0.214835 hartree
zpe.sumelectzpe: -1658.757052 hartree
zpe.sumelectthermal: -1658.737969 hartree
zpe.sumelectthermalent: -1658.737025 hartree
zpe.sumelectthermalfe: -1658.804505 hartree
dipole: 1.9547 -0.2279 2.1585
dipole: 2.9210
quadrupole: -137.3848 -114.9749 -124.2454
quadrupole: -6.4503 -2.9647 -1.2281
quadrupole: -11.8498 10.5601 1.2897 -6.4503 -2.9647 -1.2281
hfenergy: -1659.0193404 hartree
pointgroup: C01 [X(C12H15Cl2N5)]
dipole: -0.7493746 -0.0500917 -0.8698317 debye
polarizability: 286.3264985|11.5413192|189.4870329|-6.2673889|6.5921676|115.3200444 unknown
InChI: InChI=1S/C12H15Cl2N5/c1-6(2)10-17-11(15)18-12(16)19(10)7-3-4-8(13)9(14)5-7/h3-6,10H,15-16H2,1-2H3
charge 0 multiplicity 1
34 atoms
Cl 4.287452 -2.142737 0.274636
Cl 5.419653 0.955752 0.379024
N  -0.53852 -0.145782 -0.191426
N  -2.593003 0.087228 1.190538
N  -2.284193 -1.797178 -0.347995
N  -0.424387 -1.970309 -1.738063
N  -3.939278 -1.834409 1.295688
C  -1.529421 0.805693 0.492859
C  -2.090428 1.877955 -0.50287
C  -3.000515 1.279472 -1.597839
C  -2.827812 2.974235 0.301969
C  0.860114 0.095299 -0.094684
C  -1.107499 -1.311292 -0.735239
C  -2.90581 -1.113462 0.728111
C  1.789335 -0.981238 0.013169
C  1.361356 1.426528 -0.023452
C  3.164026 -0.723778 0.148271
C  2.739775 1.668276 0.134155
C  3.653596 0.598452 0.209797
H  -0.927322 1.337401 1.255899
H  -1.214221 2.340839 -1.004931
H  -3.882719 0.788467 -1.150141
H  -3.361317 2.081675 -2.267743
H  -2.469919 0.536044 -2.219142
H  -3.66955 2.52982 0.860638
H  -3.221876 3.756557 -0.372452
H  -2.157012 3.461235 1.03565
H  1.440205 -2.016283 0.021813
H  0.683447 2.27896 -0.105565
H  0.387609 -1.565313 -2.196889
H  -0.853877 -2.816876 -2.104411
H  3.113854 2.695029 0.182861
H  -4.145144 -2.762413 0.939003
H  -4.4585 -1.434147 2.071559
