program: Gaussian 09
title: 000035499
version: EM64L-G09RevD.01
frameworkgroup: C1[X(C5H6N6O2)]
method: RPBEPBE
basis: SDD
operation: Freq
keyword: #pfreq=noraman
keyword: PBEPBE/SDD
title: #p freq=noraman PBEPBE/SDD
converged: YES YES NO NO
title: Mulliken charges:
elementType: O O N N N N N N C C C C C H H H H H H
charge: -0.204699 -0.201039 -0.137294 0.009640 -0.049394 -0.017370 0.060230 -0.012729 0.092254 0.084555 -0.070002 -0.499485 -0.499427 0.239823 0.243243 0.239833 0.239171 0.239189 0.243500
chargesum: 0.00000
title: Mulliken charges with hydrogens summed into heavy atoms:
elementType: O O N N N N N N C C C C C
charge: -0.204699 -0.201039 -0.137294 0.009640 -0.049394 -0.017370 0.060230 -0.012729 0.092254 0.084555 -0.070002 0.223413 0.222434
polarizability: 1.78388439e+02 1.12690334e+01 1.13183861e+02 1.67173393e-02 2.04093155e-02 5.06304366e+01
1716.lowfreq: -7.4197 -0.0008 -0.0007 -0.0006 1.8871 7.0622 63.7183 92.8987 101.7676
frequency: 63.7148 92.8986 101.7665 118.2312 131.7384 137.1197 160.6316 200.7402 222.6593 244.8662 252.5620 325.5075 407.4411 481.0780 485.9615 516.7648 570.7677 614.0761 685.3542 699.1794 703.9925 788.1775 873.8750 886.8981 902.3416 1020.0892 1041.9934 1112.8272 1113.5741 1143.1450 1157.5905 1186.4130 1247.6252 1313.9526 1323.0331 1405.2589 1416.4782 1451.0518 1452.5481 1455.0448 1455.8994 1465.2311 1473.6868 1488.0274 2073.1394 3006.6342 3007.6080 3111.0008 3112.1391 3152.4569 3153.0306
redmass: 6.0112 2.6049 9.8624 1.3635 1.1636 3.0771 3.2010 7.1082 6.8608 7.9932 4.2278 6.1704 7.4340 8.2950 14.0007 10.5070 6.9064 8.1672 12.2562 9.7104 12.0485 12.6356 10.3713 13.3454 8.7678 11.5364 5.3621 1.2525 1.2524 1.4199 1.7318 7.9485 10.3046 5.4986 5.7409 2.5545 2.1031 1.6415 1.0515 1.0510 1.1222 1.4945 2.1353 4.3093 13.9950 1.0294 1.0295 1.1048 1.1049 1.1048 1.1048
irintensity: 3.5863 0.8113 1.2261 2.0804 0.0076 3.1083 0.3687 0.7252 1.4817 8.0699 13.9259 4.6140 6.6203 4.9160 1.9898 1.0460 0.4252 7.4290 0.0424 10.5457 0.0097 23.4692 4.6744 0.2322 6.7664 146.2167 65.5322 0.0027 0.2122 24.4857 36.5214 1.0156 13.4594 366.4559 599.9652 164.1383 188.0017 262.4883 0.5398 32.4836 182.4777 154.9080 199.5729 652.1317 440.7851 9.4416 60.9922 25.6138 25.0232 34.6899 1.6416
temp: 298.150 k
press: 1.00000 atm
elementType: 8 8 7 7 7 7 7 7 6 6 6 6 6 1 1 1 1 1 1
symmnumber: 1
zpe: 335001.2 jmol-1
zpe.correction: 0.127595 hartree
zpe.thermalcorrener: 0.140004 hartree
zpe.thermalcorrenthalpy: 0.140948 hartree
zpe.thermalcorrgfe: 0.088298 hartree
zpe.sumelectzpe: -672.045080 hartree
zpe.sumelectthermal: -672.032671 hartree
zpe.sumelectthermalent: -672.031727 hartree
zpe.sumelectthermalfe: -672.084378 hartree
dipole: -5.3853 2.1819 0.0006
dipole: 5.8105
quadrupole: -64.5445 -80.3317 -72.0858
quadrupole: -4.9987 -0.0073 -0.0214
quadrupole: 7.7762 -8.0111 0.2349 -4.9987 -0.0073 -0.0214
hfenergy: -672.1726752 hartree
pointgroup: C01 [X(C5H6N6O2)]
dipole: -2.2573111 -0.330522 -0.1457713 debye
dipolederiv: -0.9125584 -0.5152056 -0.0590405 -0.8434343 -1.1722346 -0.089791 -0.0752101 -0.0715612 -0.3295754 -1.1625165 0.6595103 -0.0164757 0.8481729 -1.049151 0.0130496 -0.0078244 0.0028474 -0.3193777 -0.6737238 0.1152784 -0.0232508 -0.0030332 -1.4029887 -0.0608135 -0.0297591 -0.0542354 -0.1703613 -1.5825137 0.608917 -0.0504133 0.4303484 -0.7497727 -0.0031582 -0.0588706 0.0068645 -0.1896163 -1.4621316 -0.3495429 -0.0904782 -0.5110837 -0.7754889 -0.0585353 -0.0981727 -0.0490139 -0.1903977 -1.6761562 0.5373462 -0.059163 0.8599146 -0.6711889 0.0243006 -0.0434621 0.0060527 -0.1755279 1.1678181 -0.7635175 0.0224699 -1.3960863 0.9259049 -0.0395632 -0.0098463 -0.0029988 0.112591 -0.7116792 0.3832259 -0.019672 0.6259928 -0.3472186 0.0207265 -0.0067554 0.0062723 -0.0388573 1.3883266 0.3662141 0.0829334 0.780658 1.7717669 0.1189505 0.1035655 0.0956706 0.2641388 1.7443252 -0.6663864 0.0541911 -0.7625207 1.649115 0.0254103 0.0501543 0.0306957 0.2407513 2.4489407 -0.4005225 0.108418 -0.0852732 1.0782589 0.0383701 0.1243405 0.0203672 0.2145064 0.6921149 0.3476094 0.0416124 0.1676721 0.3567612 0.0139867 0.0324437 0.0239192 0.2680557 0.7799113 -0.3374736 0.013336 -0.1038252 0.2911767 -0.004823 0.0249805 -0.0185147 0.267459 -0.0433035 -0.0560074 0.0370443 0.064809 0.0855158 -0.0843423 0.0709679 -0.0562891 -0.0533834 0.0657928 -0.0218845 -0.0046952 -0.0872861 -0.1169096 -0.0165455 -0.007785 -0.0128291 0.1278668 -0.031561 -0.0592044 -0.0412663 0.0603443 0.0708981 0.1037964 -0.0634038 0.0622365 -0.0510243 -0.0414187 0.041004 0.0249256 -0.0897889 0.0698621 0.1012098 0.0538239 0.0808282 -0.0397596 -0.0321087 0.0517144 -0.0183208 -0.0723744 0.086801 -0.0976824 -0.0598685 -0.0624084 -0.0660588 0.0424419 0.058925 -0.002155 0.1167938 -0.1011076 -0.0045462 0.0006815 -0.0079038 0.1285707 unknown
polarizability: 169.2691243|-25.1649559|121.8826871|5.5518942|2.0768386|51.0509259 unknown
InChI: InChI=1S/C5H6N6O2/c1-12-4-7-3(10-11-6)8-5(9-4)13-2/h1-2H3
charge 0 multiplicity 1
19 atoms
O  -1.23693 -2.22883 -0.26111
O  -1.654931 2.460523 -0.054267
N  -1.547694 0.107868 -0.164074
N  0.435685 1.510075 0.020238
N  0.64899 -0.924271 -0.088988
N  2.551204 0.51898 0.091816
N  3.286825 -0.523093 0.082201
N  4.138709 -1.33577 0.089695
C  -0.709701 -0.972055 -0.168815
C  -0.91062 1.315274 -0.066755
C  1.147823 0.34939 0.002654
C  -2.71164 -2.345998 -0.350015
C  -3.126816 2.320747 -0.147561
H  -3.186841 -1.913823 0.546053
H  -2.888415 -3.428611 -0.410874
H  -3.085517 -1.829598 -1.249497
H  -3.513249 1.735944 0.703545
H  -3.407639 1.824726 -1.091387
H  -3.493843 3.355822 -0.117959
