program: Gaussian 09
title: 000035510
version: EM64L-G09RevD.01
frameworkgroup: C1[X(C10H12ClN5)]
method: RPBEPBE
basis: SDD
operation: Freq
keyword: #p
keyword: freq=noraman
keyword: PBEPBE/SDD
title: #p freq=noraman PBEPBE/SDD
converged: NO YES NO NO
title: Mulliken charges:
elementType: Cl N N N N N C C C C C C C C C C H H H H H H H H H H H H
charge: -0.058560 -0.270418 -0.057285 -0.166207 -0.624545 -0.610104 -0.189856 0.414230 -0.672056 0.211440 -0.366567 -0.357198 -0.012488 -0.198968 -0.206808 -0.122133 0.243971 0.241906 0.205038 0.236542 0.276967 0.248492 0.255886 0.255593 0.339721 0.338916 0.323526 0.320966
chargesum: 0.00000
title: Mulliken charges with hydrogens summed into heavy atoms:
elementType: Cl N N N N N C C C C C C C C C C
charge: -0.058560 -0.270418 -0.057285 -0.166207 0.054092 0.034389 0.054115 0.414230 0.011430 0.211440 -0.089600 -0.108706 -0.012488 0.056918 0.048785 -0.122133
polarizability: 2.57034861e+02 -7.17570517e+00 1.41060128e+02 -8.32171096e+00 9.73357847e-01 9.17313248e+01
1716.lowfreq: -8.8102 -4.2542 -0.0020 -0.0019 0.0008 10.1382 40.5495 59.2219 77.8010
frequency: 40.4823 59.2129 77.7987 129.7573 141.3908 157.2411 194.3766 227.7114 234.4038 242.2586 308.8295 327.2410 348.4001 384.7793 397.9401 407.4202 425.0476 447.6770 466.3613 488.5165 513.7730 523.0681 528.2256 552.3136 601.5598 624.5395 669.6739 702.2388 703.6219 727.2501 733.8195 814.0833 825.2247 842.8152 883.5497 937.6257 941.5556 958.8795 979.6804 992.8285 1032.4745 1063.4057 1076.5734 1100.2910 1119.7738 1122.5006 1186.8529 1196.1561 1284.1533 1296.9341 1317.0967 1326.3144 1357.3015 1375.7912 1396.6037 1405.5588 1444.9576 1458.3361 1470.8117 1480.2735 1545.1571 1570.1633 1576.2168 1600.2033 1614.6043 1624.6949 2984.8479 3025.5403 3082.7615 3099.6651 3155.2554 3158.0047 3173.9297 3178.5220 3546.2188 3568.8764 3700.5771 3729.7311
redmass: 6.4556 4.2700 5.2625 5.0731 4.2857 5.8509 5.7572 1.6729 2.6730 3.3414 3.5732 4.4201 3.4775 1.1883 2.2783 2.3154 1.8494 4.3445 3.3333 2.8297 1.4799 1.3659 1.9777 3.4034 5.6827 6.9108 8.3390 4.7254 3.8054 7.5591 4.4298 1.3265 1.4523 4.0903 2.3746 2.0242 2.2311 1.3531 2.0251 3.8540 2.1100 2.6630 2.6243 2.4138 1.3918 2.0270 1.3345 2.1792 3.7251 1.2798 1.2476 1.4580 5.2987 1.2479 4.2065 3.5127 2.7626 1.0559 1.1504 2.4297 2.3234 2.1608 3.6084 5.3778 2.4894 2.2834 1.0354 1.0877 1.0997 1.0998 1.0883 1.0880 1.0966 1.0972 1.0445 1.0439 1.1053 1.1058
irintensity: 0.2162 2.0355 0.1999 0.9706 0.6477 0.8526 4.9038 1.1872 0.1525 0.2588 5.7271 2.8518 15.7103 206.6314 53.1549 60.9000 60.4112 67.3278 57.8910 1.9287 35.1766 34.4057 42.0452 5.3222 15.1084 1.0644 17.3958 29.3837 0.9476 14.3516 4.8446 22.0201 45.4356 36.6073 10.4362 3.1861 1.3337 0.8620 11.4134 28.7109 13.4274 26.2746 39.4015 11.5714 14.4698 0.5267 7.0283 25.2286 227.8176 2.9527 26.7218 14.3080 16.3777 30.7391 261.5248 37.7639 211.5374 31.6994 30.7077 284.2672 299.9423 114.3438 26.2200 114.6774 599.1823 343.9773 19.5823 17.0654 39.3291 18.1319 3.6280 5.1082 5.4186 1.3105 64.4639 95.4834 47.2128 41.1116
temp: 298.150 k
press: 1.00000 atm
elementType: 17 7 7 7 7 7 6 6 6 6 6 6 6 6 6 6 1 1 1 1 1 1 1 1 1 1 1 1
symmnumber: 1
zpe: 568287.8 jmol-1
zpe.correction: 0.216449 hartree
zpe.thermalcorrener: 0.231393 hartree
zpe.thermalcorrenthalpy: 0.232337 hartree
zpe.thermalcorrgfe: 0.174542 hartree
zpe.sumelectzpe: -1120.926218 hartree
zpe.sumelectthermal: -1120.911274 hartree
zpe.sumelectthermalent: -1120.910330 hartree
zpe.sumelectthermalfe: -1120.968125 hartree
dipole: 0.6946 -1.7281 1.9484
dipole: 2.6954
quadrupole: -108.0446 -89.9751 -100.7217
quadrupole: -5.0808 -3.2176 0.5899
quadrupole: -8.4641 9.6053 -1.1412 -5.0808 -3.2176 0.5899
hfenergy: -1121.1426672 hartree
pointgroup: C01 [X(C10H12Cl1N5)]
dipole: -0.2657437 -0.6888121 -0.7612094 debye
polarizability: 257.4844545|5.5840262|140.8535595|-4.8796712|-1.5540064|91.4882995 unknown
InChI: InChI=1S/C10H12ClN5/c1-6-14-9(12)15-10(13)16(6)8-4-2-7(11)3-5-8/h2-6H,12-13H2,1H3
charge 0 multiplicity 1
28 atoms
Cl 5.437161 -0.095122 0.499592
N  -0.59264 0.092546 -0.234261
N  -2.563151 1.074122 0.901317
N  -2.70524 -1.048091 -0.322091
N  -0.860906 -1.975216 -1.409651
N  -4.375168 -0.399045 1.177267
C  -1.35816 1.366211 0.119904
C  0.823521 0.027415 -0.095712
C  -1.711439 2.166545 -1.157732
C  -1.411329 -0.97193 -0.63713
C  1.470593 -1.164479 0.34541
C  1.619088 1.183567 -0.333237
C  -3.168786 -0.065148 0.591693
C  2.868518 -1.206101 0.517391
C  3.017333 1.152181 -0.144776
C  3.627758 -0.045233 0.269473
H  -0.670859 1.953249 0.755157
H  -2.251589 3.083813 -0.86691
H  -0.809661 2.450089 -1.731181
H  -2.373695 1.57206 -1.811983
H  0.876068 -2.052419 0.578906
H  1.153792 2.110814 -0.67872
H  3.354994 -2.123408 0.861814
H  3.619039 2.046512 -0.330234
H  0.056167 -1.881218 -1.838613
H  -1.476223 -2.742762 -1.668635
H  -4.800177 -1.293326 0.953261
H  -4.80851 0.250275 1.827082
