program: Gaussian 09
title: 000035569
version: EM64L-G09RevD.01
frameworkgroup: C1[X(C10H14Cl3N3O2)]
method: RPBEPBE
basis: SDD
operation: Freq
keyword: #p
keyword: freq=noraman
keyword: PBEPBE/SDD
title: #p freq=noraman PBEPBE/SDD
converged: YES YES NO NO
title: Mulliken charges:
elementType: Cl Cl Cl O O N N N C C C C C C C C C C H H H H H H H H H H H H H H
charge: 0.110126 0.129665 0.098943 -0.208443 -0.205972 0.031524 -0.076018 -0.047732 0.034031 0.035435 -0.691220 -0.685783 -0.690027 -0.684508 0.040773 0.026108 0.292538 -0.741421 0.240744 0.240969 0.217354 0.257403 0.226069 0.209513 0.236389 0.229120 0.217335 0.254713 0.226958 0.209445 0.236413 0.229556
chargesum: 0.00000
title: Mulliken charges with hydrogens summed into heavy atoms:
elementType: Cl Cl Cl O O N N N C C C C C C C C C C
charge: 0.110126 0.129665 0.098943 -0.208443 -0.205972 0.031524 -0.076018 -0.047732 0.274775 0.276404 0.009605 -0.010761 0.008979 -0.009095 0.040773 0.026108 0.292538 -0.741421
polarizability: 2.33915150e+02 -9.26308712e-01 1.61879794e+02 -1.11582118e+00 -4.01196274e-01 1.26596744e+02
1716.lowfreq: -7.4895 -4.7103 -0.0010 0.0007 0.0010 3.8329 8.2957 40.3513 48.3086
frequency: 6.9324 40.3177 48.2857 50.3614 75.5622 80.6871 89.3687 97.9025 159.5318 181.5548 190.1057 192.8328 194.9942 212.7719 218.3521 221.5096 235.8779 242.9395 246.1590 293.8625 300.8484 333.3087 347.2584 381.3497 404.8746 411.4960 440.0159 453.1804 531.7533 614.0508 618.8856 639.3913 706.0485 719.8384 730.9418 749.3422 796.0239 813.2249 818.1283 890.0688 891.2687 902.6938 927.3749 928.4957 941.9970 942.8662 1023.3242 1032.6428 1091.1563 1097.7578 1156.3064 1156.6684 1182.3404 1182.9955 1227.0416 1289.0285 1290.5736 1310.6717 1331.5113 1332.2312 1351.0603 1382.7980 1383.5154 1398.8690 1399.8516 1415.9761 1436.0821 1456.0221 1456.6470 1463.7144 1464.3205 1472.6629 1473.6716 1486.7974 1487.5913 1499.9312 2992.2470 2992.7721 2997.0021 2997.2784 3039.7793 3042.4663 3087.4646 3087.8225 3097.7545 3097.9954 3103.3951 3103.5651 3108.6157 3109.2936
redmass: 16.5864 3.8871 2.7936 2.6824 6.2251 4.4665 4.0139 9.4783 9.5584 7.8518 1.0573 1.0533 6.7129 2.4130 2.0095 7.4386 3.0345 1.6812 2.5487 13.4296 3.9884 3.4942 4.4092 13.8835 2.4622 4.7077 2.9496 2.9130 4.5865 7.2809 12.4935 8.8012 12.0807 7.3219 7.1227 12.2613 6.4791 12.5368 5.1301 3.1905 6.0783 3.0540 1.2240 1.2234 1.3444 1.3458 10.4868 11.1724 1.6812 1.6683 2.0086 2.0101 1.9789 1.9675 10.0284 2.0359 4.1358 1.6353 1.5175 1.4475 2.5718 1.2636 1.2651 1.2431 1.2407 7.8895 7.9207 1.0532 1.0576 1.0547 1.0487 1.0636 1.0538 1.0688 1.0534 7.3298 1.0359 1.0359 1.0360 1.0360 1.0871 1.0871 1.0989 1.0989 1.0987 1.0988 1.1009 1.1008 1.1007 1.1007
irintensity: 0.0263 2.8913 0.5966 0.3985 0.8434 0.4776 3.0663 0.6707 1.1406 0.0456 0.0530 0.0565 0.0303 0.1521 0.4332 0.1689 0.0567 0.1749 1.5573 0.7037 2.7314 3.2857 0.2420 0.0660 0.3519 7.3297 8.9652 2.0839 22.9007 12.8349 60.8103 54.5072 0.3783 46.1943 46.9391 111.8448 110.3066 0.9299 13.6441 28.8901 21.6762 1.0003 2.9124 2.7398 0.2587 0.1416 9.4913 78.0261 340.7801 0.5253 9.0896 12.1546 28.9879 9.7388 341.7471 510.9137 51.1069 48.7044 20.5294 7.4001 139.8264 30.3348 54.7711 27.9793 28.5073 413.0415 36.5400 8.4511 2.6626 12.9917 3.3042 8.8297 3.2171 10.3382 18.7090 787.7647 13.6117 12.3120 29.6220 16.0222 3.9429 3.5198 9.5934 8.1076 44.0226 32.0402 13.5831 18.4986 30.2965 31.4076
temp: 298.150 k
press: 1.00000 atm
elementType: 17 17 17 8 8 7 7 7 6 6 6 6 6 6 6 6 6 6 1 1 1 1 1 1 1 1 1 1 1 1 1 1
symmnumber: 1
zpe: 615513.7 jmol-1
zpe.correction: 0.234437 hartree
zpe.thermalcorrener: 0.254861 hartree
zpe.thermalcorrenthalpy: 0.255805 hartree
zpe.thermalcorrgfe: 0.182482 hartree
zpe.sumelectzpe: -2082.941469 hartree
zpe.sumelectthermal: -2082.921045 hartree
zpe.sumelectthermalent: -2082.920101 hartree
zpe.sumelectthermalfe: -2082.993424 hartree
dipole: -0.1983 -0.0512 -0.0574
dipole: 0.2127
quadrupole: -99.8683 -143.1966 -124.5745
quadrupole: -1.2426 -0.7099 -0.0995
quadrupole: 22.6782 -20.6501 -2.0280 -1.2426 -0.7099 -0.0995
hfenergy: -2083.1759058 hartree
pointgroup: C01 [X(C10H14Cl3N3O2)]
dipole: 0.0778795 0.0261001 -0.0159608 debye
polarizability: 233.3433816|2.4292392|161.5853167|7.2585505|3.8530083|127.4629906 unknown
InChI: InChI=1S/C10H14Cl3N3O2/c1-5(2)17-8-14-7(10(11,12)13)15-9(16-8)18-6(3)4/h5-6H,1-4H3
charge 0 multiplicity 1
32 atoms
Cl -0.83596 -2.9539 -2.032017
Cl 1.755983 -3.134151 -0.508369
Cl -0.862473 -3.158004 0.995919
O  -2.351596 1.724227 -0.356145
O  2.211627 1.837958 0.188657
N  -0.070501 1.803547 -0.084294
N  1.206003 -0.272382 -0.150195
N  -1.191563 -0.329981 -0.43078
C  -3.643631 0.947845 -0.56645
C  3.556793 1.129558 0.263019
C  -4.082984 0.344865 0.77317
C  -4.611345 1.983349 -1.138601
C  4.048834 0.854669 -1.162658
C  4.440306 2.088213 1.060749
C  -1.181243 1.038458 -0.287283
C  1.091227 1.099961 -0.024377
C  0.031511 -0.910085 -0.349903
C  0.047237 -2.44064 -0.47449
H  -3.420973 0.146636 -1.293835
H  3.389802 0.179402 0.801022
H  -5.061426 -0.154243 0.649485
H  -3.357898 -0.407508 1.125025
H  -4.191427 1.135099 1.536713
H  -5.581346 1.502944 -1.35991
H  -4.215379 2.419596 -2.071098
H  -4.78102 2.800157 -0.41593
H  5.058156 0.40571 -1.124543
H  3.380137 0.148122 -1.681236
H  4.108847 1.793427 -1.740788
H  5.444112 1.645574 1.191938
H  4.010446 2.283634 2.057548
H  4.547845 3.051241 0.532355
