program: Gaussian 09
title: 000035508
version: EM64L-G09RevD.01
frameworkgroup: C1[X(C6H6Cl9N3)]
method: RPBEPBE
basis: SDD
operation: Freq
keyword: #p
keyword: freq=noraman
keyword: PBEPBE/SDD
title: #p freq=noraman PBEPBE/SDD
converged: YES YES NO NO
title: Mulliken charges:
elementType: Cl Cl Cl Cl Cl Cl Cl Cl Cl N N N C C C C C C H H H H H H
charge: 0.112838 0.112723 0.013456 0.112527 0.112575 0.013375 0.112446 0.112570 0.014675 0.092825 0.092629 0.093429 -0.306100 -0.307522 -0.307316 -0.579585 -0.579202 -0.581092 0.281634 0.273161 0.273179 0.281323 0.281642 0.273812
chargesum: 0.00000
title: Mulliken charges with hydrogens summed into heavy atoms:
elementType: Cl Cl Cl Cl Cl Cl Cl Cl Cl N N N C C C C C C
charge: 0.112838 0.112723 0.013456 0.112527 0.112575 0.013375 0.112446 0.112570 0.014675 0.092825 0.092629 0.093429 0.248694 0.246980 0.248139 -0.579585 -0.579202 -0.581092
polarizability: 1.93460977e+02 -1.14722806e-01 1.93462380e+02 -9.21325384e-02 8.92874529e-02 1.59972491e+02
1716.lowfreq: -4.9067 -0.0018 -0.0013 0.0023 4.1350 6.0088 12.7665 15.0474 16.8350
frequency: 12.5866 14.8841 16.7641 27.2981 34.6524 37.7581 101.6390 102.6491 152.9787 171.3864 171.8537 175.9665 223.6526 224.6134 231.0092 247.3672 248.2090 248.2891 271.3838 274.3094 305.0512 323.2101 324.2361 348.6860 350.1603 354.2648 405.4696 406.6465 413.8299 431.9638 537.3951 538.9992 603.2131 634.6025 635.8493 739.5105 742.2745 742.7022 802.2611 886.2822 918.8278 919.8544 977.5529 979.2964 1065.1117 1095.0053 1154.7447 1157.1676 1189.6543 1192.5434 1212.2025 1351.0946 1366.1087 1367.6107 1375.9447 1385.2470 1386.3836 1465.2888 1466.4475 1477.4059 2923.0613 2924.7760 2930.0213 3140.5486 3141.7706 3144.9373
redmass: 31.2914 32.3981 32.6039 15.9706 10.9466 11.1335 20.2387 19.9605 29.2156 29.3910 29.3933 31.8324 14.3177 14.8924 23.9593 19.5005 18.6427 18.7095 3.9472 4.0318 11.5338 8.1022 7.7582 7.6291 7.5205 14.4354 6.8139 6.5745 6.5197 1.8935 9.4329 9.4516 8.7269 11.9902 11.9824 11.0853 10.3854 10.4049 9.4111 6.0716 4.4039 4.4087 1.7311 1.7331 2.2571 12.4275 2.2396 2.2508 6.9707 7.0162 1.0131 1.1659 1.6293 1.6360 6.2588 1.3068 1.2980 1.0775 1.0764 1.1106 1.0708 1.0706 1.0708 1.0897 1.0905 1.0934
irintensity: 0.2800 0.3558 0.0791 1.8432 1.8663 1.9464 0.3383 0.4264 0.0781 0.0965 0.0881 0.0017 0.7729 0.6109 0.2488 0.0893 1.4214 1.3876 3.9007 3.9060 34.8470 0.0473 0.0632 47.0377 46.1217 1.3085 36.8136 35.5546 0.1645 5.2676 131.6403 128.5066 473.6667 15.2908 14.7937 116.0310 117.5090 116.7093 0.0292 90.7931 18.2713 18.3827 118.7048 123.1229 1.5964 0.1578 837.5256 833.1821 173.1747 169.8037 1.1157 0.6340 129.5365 125.7744 12.1774 30.6131 26.0982 8.0540 8.2459 21.3539 2.0278 1.0460 58.8839 1.1851 1.0906 0.4424
temp: 298.150 k
press: 1.00000 atm
elementType: 17 17 17 17 17 17 17 17 17 7 7 7 6 6 6 6 6 6 1 1 1 1 1 1
symmnumber: 1
zpe: 336297.0 jmol-1
zpe.correction: 0.128089 hartree
zpe.thermalcorrener: 0.149231 hartree
zpe.thermalcorrenthalpy: 0.150175 hartree
zpe.thermalcorrgfe: 0.071776 hartree
zpe.sumelectzpe: -4535.566757 hartree
zpe.sumelectthermal: -4535.545614 hartree
zpe.sumelectthermalent: -4535.544670 hartree
zpe.sumelectthermalfe: -4535.623070 hartree
dipole: 0.0496 0.0132 1.0554
dipole: 1.0566
quadrupole: -179.9033 -179.7099 -168.6787
quadrupole: 0.1289 -0.0005 0.1035
quadrupole: -3.8060 -3.6126 7.4186 0.1289 -0.0005 0.1035
hfenergy: -4535.6948454 hartree
pointgroup: C01 [X(C6H6Cl9N3)]
dipole: 0.0149584 0.0153556 -0.4151564 debye
dipolederiv: -0.3937426 0.2145206 0.2458568 0.1567448 -0.3819278 -0.1957723 0.2049445 -0.1622582 -0.3351384 -0.5953995 -0.016042 -0.2923769 0.0322232 -0.2015771 0.0285036 -0.2434841 0.0295344 -0.2974354 -0.2852103 -0.149017 0.091317 -0.1627275 -0.6545048 0.2685751 0.2178799 0.5875566 -0.7697261 -0.2234535 -0.0592029 0.0451741 -0.1159542 -0.5602556 0.3068495 0.0348653 0.2541334 -0.3257453 -0.2944679 0.1411186 0.1237499 0.1900517 -0.496511 -0.2701201 0.0996087 -0.229443 -0.3050195 -0.6959721 -0.0707058 -0.2799983 -0.079659 -0.2403601 -0.0476356 -0.6191809 -0.0968985 -0.7733059 -0.550523 -0.0767933 -0.2856915 -0.1302557 -0.2334596 -0.1137167 -0.2361916 -0.0977074 -0.3210649 -0.3042804 -0.1959658 0.1780241 -0.1435334 -0.4835571 0.2447576 0.1518212 0.2018695 -0.3131135 -0.4161054 0.2400623 0.1788816 0.2374991 -0.5306696 -0.2244842 0.3897639 -0.4949263 -0.7655993 -0.8560973 -0.3930605 0.0029562 -0.3772901 -1.679733 0.0128798 -0.0722597 -0.1790745 -0.5028506 -1.8092652 -0.1690162 -0.0212727 -0.1547603 -0.7284346 -0.0062183 0.187517 0.0225522 -0.5003616 -1.1331867 0.5453289 0.0078727 0.5504901 -1.4110296 -0.0104358 -0.1294457 0.1633091 -0.4986465 0.7883464 0.5878703 0.1014853 0.5839157 0.5015151 -0.1321696 0.073233 -0.1028583 0.4020992 0.0604071 -0.1652289 -0.1636448 -0.1669348 1.2332774 -0.0201115 -0.1203769 -0.0069253 0.4007066 1.0826986 -0.4213173 0.0653188 -0.4252476 0.2060811 0.1513666 0.0470453 0.1110847 0.4053301 1.3743445 0.372244 -0.0477646 0.3819982 2.2102795 -0.1141749 -0.0873783 -0.2312923 1.5198708 2.32904 0.1664533 0.1293079 0.1744007 1.2565875 0.0141633 0.249658 0.0378338 1.5201372 1.6632088 -0.55299 -0.0787313 -0.5527517 1.9370917 0.1026158 -0.1513601 0.1921785 1.5170398 0.1437224 0.079781 0.0038183 0.0767319 0.1008168 -0.0040153 0.0247715 -0.0283729 0.0902586 -0.0676652 -0.130204 0.0240909 -0.127047 -0.0038371 -0.0280927 -0.0131285 0.018033 -0.1100345 0.0915721 0.037112 -0.0391171 0.0367346 -0.1639124 -0.0045221 0.0205172 0.0005459 -0.1116346 0.0438245 -0.0200832 -0.0044313 -0.0217423 0.2006681 -0.0012186 -0.036623 -0.0067504 0.0919524 0.1787852 -0.0559198 0.0020738 -0.0568303 0.0639559 0.0041611 0.0139549 0.0348851 0.0919692 -0.1305806 0.0910557 0.013101 0.0939438 0.0594965 0.0388153 -0.0061517 -0.0170089 -0.1096877 unknown
polarizability: 193.3650338|-0.0622419|193.5576994|0.0452567|0.1879312|159.9731146 unknown
InChI: InChI=1S/C6H6Cl9N3/c7-4(8,9)16-1-17(5(10,11)12)3-18(2-16)6(13,14)15/h1-3H2
charge 0 multiplicity 1
24 atoms
Cl -0.129821 3.6379 1.256873
Cl 2.680988 2.522248 1.167601
Cl 1.365547 3.517039 -1.404294
Cl -3.084365 -1.955505 1.216511
Cl -3.525283 1.037657 1.175093
Cl -3.724891 -0.558447 -1.423087
Cl 3.230551 -1.699086 1.217519
Cl 0.843269 -3.558498 1.198953
Cl 2.331006 -2.980342 -1.405661
N  0.525158 1.278843 0.060321
N  -1.368157 -0.189104 0.050788
N  0.849173 -1.091915 0.042173
C  -0.869382 1.124924 -0.415833
C  1.407871 0.195136 -0.430437
C  -0.533936 -1.311892 -0.437972
C  1.039302 2.554895 0.282953
C  -2.73032 -0.38552 0.268416
C  1.691957 -2.17664 0.274043
H  -1.494789 1.929158 -0.011801
H  -0.891275 1.163367 -1.529118
H  1.434498 0.206473 -1.544241
H  2.423198 0.331177 -0.041046
H  -0.9206 -2.26245 -0.052929
H  -0.547598 -1.331616 -1.551925
