program: Gaussian 09
title: 000000635
version: EM64L-G09RevD.01
frameworkgroup: C1[X(C5H11O7P)]
method: RPBEPBE
basis: SDD
operation: Freq
keyword: #p
keyword: freq=noraman
keyword: PBEPBE/SDD
title: #p freq=noraman PBEPBE/SDD
converged: YES YES NO NO
title: Mulliken charges:
elementType: P O O O O O O O C C C C C H H H H H H H H H H H
charge: 1.372908 -0.364858 -0.474257 -0.500418 -0.391766 -0.666975 -0.695926 -0.601216 0.019419 -0.187505 -0.491026 -0.037019 -0.346888 0.256347 0.258906 0.238268 0.265992 0.265578 0.238203 0.267724 0.367808 0.365589 0.392877 0.448232
chargesum: 0.00000
title: Mulliken charges with hydrogens summed into heavy atoms:
elementType: P O O O O O O O C C C C C
charge: 1.372908 -0.364858 -0.106449 -0.500418 -0.026177 -0.274098 -0.247693 -0.601216 0.275767 0.071401 0.013234 0.228559 0.159040
polarizability: 1.22450548e+02 1.46672784e+00 8.75462519e+01 -1.90439861e+00 -1.17538310e+00 8.55637333e+01
1716.lowfreq: -11.7690 -6.0203 -0.0016 -0.0015 -0.0014 4.5878 10.3818 46.0569 74.0990
frequency: 3.1957 45.8625 74.0522 146.0251 156.0360 175.0372 190.3029 197.1973 236.4966 278.6819 312.5484 316.4659 341.6521 355.0076 358.2109 390.9742 433.0822 446.2186 459.0408 496.7246 607.2227 667.3952 702.9548 734.8284 746.6249 767.8501 801.4953 807.3861 815.5448 848.6186 869.3604 948.9634 961.0901 980.0789 1009.9946 1019.1074 1033.1671 1074.4542 1093.4899 1103.3571 1149.9485 1178.1052 1203.1118 1228.7175 1273.8198 1275.5871 1299.8505 1313.2610 1317.0647 1332.3744 1356.8949 1366.1050 1414.1334 1443.5199 1447.5627 2835.4926 3024.6637 3028.0574 3032.4983 3047.5973 3097.5642 3105.2229 3132.5995 3411.5146 3585.7642 3594.1781
redmass: 8.9874 6.3754 8.2076 4.9928 5.6894 6.5304 6.4002 2.7379 3.0917 2.8469 3.0563 1.1567 3.8770 9.6405 5.9045 5.7632 2.5888 3.3533 3.7094 4.0565 8.9016 1.1676 11.4998 3.8428 3.9626 4.6810 3.3398 3.3850 1.5971 2.9140 3.3528 2.6464 4.3134 2.0226 1.5594 2.6017 2.4137 2.0977 2.8998 2.8454 1.2440 1.3583 1.3468 1.1442 1.3434 1.3538 1.3166 1.2237 1.3407 1.1942 1.4339 1.4255 1.2040 1.0802 1.1002 1.0737 1.0674 1.0660 1.0756 1.0854 1.1075 1.1037 1.0912 1.0652 1.0667 1.0660
irintensity: 2.5199 2.1729 1.9255 5.8403 6.1525 5.7750 7.9561 25.4248 31.2280 53.4901 47.7419 105.7836 34.4864 20.8100 6.1191 24.3481 4.9285 5.7127 22.1712 12.1438 38.1242 170.7866 180.0427 27.1429 143.6500 54.3499 67.9834 87.4956 250.4140 7.0446 60.9545 25.4301 174.7718 20.6147 15.6073 52.9705 30.6403 154.6551 188.2204 46.1787 19.3252 31.6667 3.4214 5.0341 9.1416 2.9838 43.9593 33.5544 8.2484 57.8050 7.3232 8.7916 68.9099 10.4356 17.6361 1596.1306 6.3330 12.6364 13.5352 35.2218 9.9826 10.6787 19.6063 55.6936 17.3616 61.9535
temp: 298.150 k
press: 1.00000 atm
elementType: 15 8 8 8 8 8 8 8 6 6 6 6 6 1 1 1 1 1 1 1 1 1 1 1
symmnumber: 1
zpe: 463559.0 jmol-1
zpe.correction: 0.176560 hartree
zpe.thermalcorrener: 0.190680 hartree
zpe.thermalcorrenthalpy: 0.191624 hartree
zpe.thermalcorrgfe: 0.133317 hartree
zpe.sumelectzpe: -1063.843899 hartree
zpe.sumelectthermal: -1063.829780 hartree
zpe.sumelectthermalent: -1063.828835 hartree
zpe.sumelectthermalfe: -1063.887143 hartree
dipole: -9.0791 -5.0828 0.1519
dipole: 10.4062
quadrupole: -75.7333 -85.6974 -86.5681
quadrupole: 3.5386 13.2254 -5.9584
quadrupole: 6.9330 -3.0312 -3.9018 3.5386 13.2254 -5.9584
hfenergy: -1064.0204593 hartree
pointgroup: C01 [X(C5H11O7P1)]
dipole: 3.5010499 -2.0255059 0.6337495 debye
dipolederiv: 2.6011108 -0.0485462 0.0972817 -0.0882413 1.813121 0.1145375 0.4265961 0.0275231 1.6530578 -1.2639218 -0.125821 0.2677471 -0.1306354 -0.6170172 0.2039763 0.0465868 0.1440345 -0.6407415 -0.3027776 -0.1246296 0.0951312 -0.0736788 -0.7170437 -0.1435811 0.1282571 -0.1587108 -0.6356858 -1.4262462 0.314718 -0.1406869 0.428032 -0.716367 0.0762173 -0.073141 0.0513136 -0.4841195 -0.642367 -0.0274111 0.0234012 0.0800986 -0.3303849 -0.1547464 0.20872 0.0160657 -0.9096689 -0.6730564 -0.0404539 -0.2394992 -0.1374918 -0.7721806 -0.2279284 -0.4087577 -0.1894528 -0.845774 -1.4590779 -0.1757662 0.119224 -0.0906188 -0.7596319 0.0155116 -0.0095298 0.0451285 -0.5950522 -0.787922 0.0577735 0.0362144 0.0138119 -0.6166602 -0.0354441 -0.0239354 -0.0582274 -0.6166971 0.0258965 0.0631982 0.0685664 0.108323 0.4198825 -0.195634 -0.0585112 -0.2064878 0.3506353 0.2139626 0.0400533 -0.0639676 -0.0558365 0.4661172 0.1585542 -0.0802838 0.1979222 0.5022342 -0.176413 -0.0413733 -0.0914473 0.0702574 -0.1819103 0.0738972 0.0366256 0.0708215 -0.0692272 1.0230308 0.1528859 -0.3229842 0.0439701 0.4957528 0.0706762 -0.4223072 -0.0889395 1.0761354 0.8290434 -0.2219059 0.0219061 -0.1051785 0.2339421 0.0063979 -0.1926888 0.0892693 0.1169273 0.0750983 0.0016079 0.006376 -0.0081951 0.0067623 -0.0042393 0.0022955 0.0142868 -0.0987561 0.0612044 0.0322692 -0.0335798 0.057411 -0.0552877 0.0677012 -0.0347487 0.0550317 -0.0886981 0.1169484 -0.0100614 -0.0161628 -0.0080881 0.0371283 -0.0534835 -0.05561 -0.0623404 -0.0914921 -0.0922275 0.0213536 0.0508457 0.0368458 0.0824433 -0.0194182 0.0944797 -0.0082766 0.0716182 0.0348278 -0.0146483 0.0054949 -0.0427297 -0.0801813 -0.0242552 0.0275879 0.0054109 0.0392088 -0.0364725 0.0562268 -0.0105377 0.0599444 -0.0801327 0.0615686 -0.0065365 0.0682397 0.0827322 0.0188457 0.0146389 0.0001167 0.0028865 0.1017537 0.019 0.0365924 -0.0320576 -0.0414177 0.0980897 0.1334239 -0.0190921 0.0665814 0.3401604 0.0022935 -0.0597729 0.0097367 0.2768829 0.372797 -0.0028512 -0.01173 -0.0493226 0.2356746 -0.035119 -0.0175433 -0.0298643 0.3560809 0.1849884 -0.0202223 0.1118255 -0.0236439 0.3621784 -0.0067829 0.0970249 -0.014619 0.3215273 1.204638 -0.0344588 0.0455566 -0.1545017 0.331881 0.0303007 0.3386005 0.0541918 0.2702899 unknown
polarizability: 122.1118307|-3.6222609|88.3460713|-2.0971132|0.2566985|85.1026307 unknown
InChI: InChI=1S/C5H11O7P/c6-3-1-5(7)12-4(3)2-11-13(8,9)10/h3-9H,1-2H2
charge 0 multiplicity 1
24 atoms
P  -2.756157 0.18715 -0.012934
O  0.678594 0.844559 0.222938
O  2.055251 -1.794977 -0.676541
O  -1.738744 -0.878594 0.941392
O  2.056983 0.831909 -1.780058
O  -3.234997 -0.795807 -1.353057
O  -1.679601 1.220821 -0.784128
O  -3.955977 0.750906 0.846999
C  0.690296 -0.506075 0.885924
C  2.105266 -1.059079 0.616874
C  2.954867 0.221969 0.463131
C  2.029502 1.124661 -0.383523
C  -0.466804 -1.374771 0.376714
H  0.552972 -0.326623 1.968103
H  2.443308 -1.729252 1.427357
H  3.131803 0.680451 1.452262
H  3.923629 0.044997 -0.030986
H  2.185673 2.206787 -0.286058
H  -0.356077 -2.402276 0.763188
H  -0.488976 -1.41183 -0.726407
H  2.866626 -2.351953 -0.777745
H  2.010109 -0.161212 -1.888642
H  -4.178356 -1.094515 -1.293987
H  -0.707788 1.220555 -0.435717
