program: Gaussian 09
title: 000035502
version: EM64L-G09RevD.01
frameworkgroup: C1[X(C4H4Cl3N5O)]
method: RPBEPBE
basis: SDD
operation: Freq
keyword: #p
keyword: freq=noraman
keyword: PBEPBE/SDD
title: #p freq=noraman PBEPBE/SDD
converged: NO YES NO NO
title: Mulliken charges:
elementType: Cl Cl Cl O N N N N N C C C C H H H H
charge: 0.130229 0.090315 0.101405 -0.395131 -0.126468 0.010958 -0.016391 -0.600484 -0.599192 0.257510 0.236432 0.221295 -0.746745 0.352775 0.365289 0.365343 0.352860
chargesum: 0.00000
title: Mulliken charges with hydrogens summed into heavy atoms:
elementType: Cl Cl Cl O N N N N N C C C C
charge: 0.130229 0.090315 0.101405 -0.395131 -0.126468 0.010958 -0.016391 0.117580 0.119010 0.257510 0.236432 0.221295 -0.746745
polarizability: 1.58334189e+02 -7.66897386e-01 1.34503337e+02 -5.30542552e-02 -1.11490973e-02 7.26276060e+01
1716.lowfreq: -6.5329 -4.3905 -0.0031 -0.0029 -0.0014 4.6707 7.8443 72.9667 124.9860
frequency: 5.3274 72.9626 124.9842 139.5152 204.3359 211.7722 216.6920 218.6866 276.8270 301.0928 307.9741 334.7403 372.3124 377.3874 520.6856 527.8011 529.8022 547.8072 558.9718 600.9564 612.2421 633.5548 665.2588 699.7506 707.1815 754.6084 778.3866 787.6076 926.5233 1015.1861 1087.4006 1145.6126 1192.1052 1302.5668 1333.7650 1416.1933 1451.3041 1503.0508 1522.2104 1608.7334 1652.1693 3488.6467 3494.6273 3687.3498 3689.9763
redmass: 8.8439 16.3189 12.3263 6.8920 13.1019 12.0734 13.3197 9.1653 14.1728 6.9105 2.9778 6.9849 29.4456 8.5757 1.1360 7.3837 1.2050 8.2430 5.2113 9.7679 1.4095 1.1409 3.0886 6.6565 12.1300 9.2595 11.6365 10.2175 3.1278 2.8631 3.8632 3.6907 5.0414 5.0396 7.9071 6.4488 5.0091 1.5292 1.3919 3.5657 4.7468 1.0482 1.0481 1.1010 1.1015
irintensity: 0.0462 0.1974 0.2888 9.2933 2.3160 3.3598 1.0377 0.1267 1.6036 2.6100 5.0686 24.5141 0.2210 13.6549 30.0414 1.8262 272.4125 53.8657 5.1606 22.0230 5.7170 337.3440 0.8729 25.7820 131.2345 137.8102 6.4306 45.7127 9.2016 0.4485 63.8386 0.0011 92.0548 17.5722 30.6924 33.0337 1.1134 7.0887 7.1891 952.5291 316.2206 105.5728 111.9290 114.4804 74.6203
temp: 298.150 k
press: 1.00000 atm
elementType: 17 17 17 8 7 7 7 7 7 6 6 6 6 1 1 1 1
symmnumber: 1
zpe: 260825.7 jmol-1
zpe.correction: 0.099343 hartree
zpe.thermalcorrener: 0.111989 hartree
zpe.thermalcorrenthalpy: 0.112933 hartree
zpe.thermalcorrgfe: 0.057792 hartree
zpe.sumelectzpe: -1882.987951 hartree
zpe.sumelectthermal: -1882.975306 hartree
zpe.sumelectthermalent: -1882.974362 hartree
zpe.sumelectthermalfe: -1883.029503 hartree
dipole: -3.5405 0.1853 -0.0849
dipole: 3.5464
quadrupole: -98.8358 -77.5783 -96.9133
quadrupole: 0.1223 -0.1193 0.0268
quadrupole: -7.7266 13.5308 -5.8042 0.1223 -0.1193 0.0268
hfenergy: -1883.0872945 hartree
pointgroup: C01 [X(C4H4Cl3N5O1)]
dipole: 1.3948388 -0.0248103 0.0237501 debye
dipolederiv: -0.1972568 -0.2140386 -0.0158129 -0.1757281 -0.636603 -0.041731 -0.0025374 -0.0370807 -0.1339342 -0.4479958 0.0793444 0.196387 0.1775877 -0.2469315 -0.2421804 0.275555 -0.2167285 -0.6361252 -0.366502 0.0935936 -0.1846683 0.1803306 -0.2932011 0.2835851 -0.2014123 0.2483686 -0.577692 -1.1524422 -0.0421499 -0.0279265 -0.0441242 -0.3219163 -0.0031951 -0.034512 -0.0033388 -0.3597167 0.7345388 0.088017 0.0210389 0.1182524 -1.0604717 0.0547425 0.0253722 0.0536652 0.1035413 -0.6938755 -0.4565757 -0.0017864 -0.1245751 -0.7364602 0.0250915 -0.0166121 -0.0041016 -0.161165 -0.604827 0.4375944 -0.0378135 0.0441199 -0.6686832 0.0172374 -0.0189229 0.0483282 -0.201603 -0.4433044 -0.5726676 0.0350404 -0.4938985 -1.2028259 0.0030491 0.0285211 -0.0060925 -0.6520288 -0.5179918 0.6496247 -0.0198584 0.523347 -1.1092059 0.0419048 -0.0172304 0.0517461 -0.6579787 0.3883697 0.0125705 0.0147587 -0.0767803 0.6496711 -0.0352975 -0.0604318 -0.0336707 -0.0700362 0.5750004 0.5844943 -0.0093583 0.6611324 1.6215467 -0.0357643 -0.0046053 -0.030687 0.2065397 0.6027397 -0.679611 0.0476766 -0.7591608 1.5028136 -0.0842245 0.056966 -0.0895499 0.2210355 1.2015987 0.0421778 0.011402 -0.0135214 1.2609342 0.0049482 -0.0022424 0.0061337 1.380514 0.1887271 -0.0095247 -0.009194 0.0498025 0.3449776 0.0040396 -0.0111136 0.0031948 0.3864352 0.2605556 0.0576664 -0.0078565 0.1365178 0.2875111 0.0089994 -0.011076 0.0076744 0.3786808 0.2751582 -0.0640588 -0.0024395 -0.1411001 0.2666415 -0.0006144 0.0006774 0.0015565 0.3810527 0.1975073 -0.0064568 -0.0095893 -0.0622018 0.3422032 -0.0005906 -0.0063955 0.0005822 0.3924804 unknown
polarizability: 158.2161864|0.189991|134.3646655|3.4888937|-2.6508638|72.8842801 unknown
InChI: InChI=1S/C4H4Cl3N5O/c5-4(6,7)1-10-2(8)12(13)3(9)11-1/h8-9H2
charge 0 multiplicity 1
17 atoms
Cl -2.912462 -1.690752 -0.168363
Cl -2.916716 0.820834 1.507174
Cl -2.86669 1.000194 -1.521436
O  3.327869 0.269419 0.170426
N  1.971213 0.19931 0.110392
N  -0.163966 1.303203 -0.03679
N  -0.048367 -1.115572 0.072555
N  1.894918 2.516663 0.007621
N  2.117561 -2.115408 0.217364
C  -0.720698 0.060582 -0.01087
C  1.187907 1.358713 0.024013
C  1.307309 -1.029627 0.131945
C  -2.245335 0.022196 -0.055009
H  1.408237 3.4064 -0.054917
H  2.914177 2.429852 0.056333
H  3.123592 -1.930639 0.257415
H  1.713651 -3.047468 0.236548
