program: Gaussian 09
title: 000035503
version: EM64L-G09RevD.01
frameworkgroup: C1[X(C5H5Cl3N4O)]
method: RPBEPBE
basis: SDD
operation: Freq
keyword: #p
keyword: freq=noraman
keyword: PBEPBE/SDD
title: #p freq=noraman PBEPBE/SDD
converged: YES YES NO NO
title: Mulliken charges:
elementType: Cl Cl Cl O N N N N C C C C C H H H H H
charge: 0.129367 0.098589 0.102059 -0.347658 -0.095924 0.037453 0.019646 -0.597116 0.254934 0.219463 0.199313 -0.747110 -0.767452 0.256745 0.256441 0.256817 0.369159 0.355274
chargesum: 0.00000
title: Mulliken charges with hydrogens summed into heavy atoms:
elementType: Cl Cl Cl O N N N N C C C C C
charge: 0.129367 0.098589 0.102059 -0.347658 -0.095924 0.037453 0.019646 0.127317 0.254934 0.219463 0.199313 0.022893 -0.767452
polarizability: 1.62346563e+02 -3.89828718e+00 1.32719799e+02 -1.29192697e-02 -2.21273042e-02 7.82946189e+01
1716.lowfreq: -7.8281 -6.5715 -1.6457 -0.0023 0.0020 0.0024 8.3724 69.3296 118.9971
frequency: 3.4018 69.3209 118.9906 123.4805 137.8535 205.0089 208.5169 214.4141 220.3950 275.8545 287.1072 309.1510 347.3828 372.9564 393.5030 524.5699 538.6994 540.4187 558.8883 566.1819 627.5956 658.1283 685.2423 717.2512 753.5924 790.2877 793.0841 920.3980 979.3706 1039.4682 1063.6176 1073.4162 1198.4409 1258.8329 1321.0026 1362.9576 1402.3345 1403.0889 1440.4818 1441.6645 1498.0263 1522.3316 1640.8912 2996.1442 3068.4089 3147.7023 3474.3248 3679.2818
redmass: 7.7202 10.3401 1.5431 10.8040 2.0008 13.5364 9.3636 10.6256 7.9352 13.8279 3.4453 6.2436 5.2282 29.1179 9.8408 6.6771 6.7514 1.5030 5.4295 2.3741 9.0539 1.1562 6.4570 10.6875 9.2997 8.8015 10.5421 3.0063 3.2524 1.5447 2.9925 3.3780 6.6511 4.6537 7.7241 3.9064 1.5556 3.6721 1.3118 1.1322 1.8036 2.2399 4.7812 1.0388 1.0951 1.0998 1.0491 1.1000
irintensity: 0.0496 0.5357 1.2315 0.0868 5.2181 2.7170 0.3856 0.8117 1.7148 0.1365 1.5276 4.4543 22.7301 0.1994 3.2436 7.0906 44.7951 74.2521 2.9946 93.1537 98.9030 118.1120 28.7021 102.0326 145.9151 35.1852 8.5806 22.7141 1.4838 4.8071 4.2012 33.6384 115.4003 19.2543 40.5491 15.9680 9.0606 29.4811 57.6343 32.6323 35.9901 108.7419 505.0900 0.8870 4.8166 3.2430 107.7115 100.1816
temp: 298.150 k
press: 1.00000 atm
elementType: 17 17 17 8 7 7 7 7 6 6 6 6 6 1 1 1 1 1
symmnumber: 1
zpe: 286945.0 jmol-1
zpe.correction: 0.109292 hartree
zpe.thermalcorrener: 0.122376 hartree
zpe.thermalcorrenthalpy: 0.123320 hartree
zpe.thermalcorrgfe: 0.066586 hartree
zpe.sumelectzpe: -1866.927669 hartree
zpe.sumelectthermal: -1866.914585 hartree
zpe.sumelectthermalent: -1866.913640 hartree
zpe.sumelectthermalfe: -1866.970375 hartree
dipole: -3.0325 1.8097 -0.0168
dipole: 3.5314
quadrupole: -101.4542 -83.5411 -95.6157
quadrupole: -4.2400 -0.0491 0.0117
quadrupole: -7.9172 9.9959 -2.0787 -4.2400 -0.0491 0.0117
hfenergy: -1867.0369607 hartree
pointgroup: C01 [X(C5H5Cl3N4O1)]
dipole: -1.2178417 -0.6661536 -0.0587112 debye
dipolederiv: -0.2002392 0.2174421 -0.003706 0.1845242 -0.6377432 0.0107453 -0.0000418 0.0101486 -0.1318677 -0.4278068 -0.0946685 0.1919157 -0.1797625 -0.2607032 0.2546528 0.2384714 0.2295248 -0.5911044 -0.380768 -0.0817704 -0.1802564 -0.1612758 -0.2618662 -0.2668695 -0.2096638 -0.235106 -0.6075773 -1.1565632 0.0186783 -0.0309301 -0.033398 -0.3047146 -0.0007547 -0.034402 0.0011378 -0.3201187 0.8062043 0.0402289 0.02667 -0.2208598 -0.8391624 -0.0361475 0.0207608 -0.0255222 0.1459698 -0.6726241 0.1071848 -0.0185456 0.2455432 -0.5636485 -0.0041033 -0.015166 -0.0056821 -0.1298821 -0.4659741 -0.4723448 -0.0239457 0.0468626 -0.5538088 -0.0063671 -0.0084319 -0.0312671 -0.1969739 -0.5236577 -0.6145076 -0.0119995 -0.5748286 -1.1040625 -0.0347413 -0.0113821 -0.0369772 -0.6413631 0.4087701 -0.1262034 0.0111741 -0.4209651 0.9085745 0.0077143 0.0049786 0.0156852 0.0544322 0.4125618 0.1079951 0.0203296 -0.0533506 0.3761214 0.0100091 -0.0088733 0.0176355 -0.0615483 0.4713295 0.7195418 0.0303962 0.8864604 1.3653544 0.0654747 0.0371507 0.0619199 0.2170436 -0.1175051 0.2943957 0.0027727 0.1650413 -0.1610442 0.0023204 -0.0019392 0.0119806 0.006996 1.1712716 -0.0680404 -0.0036433 -0.0251333 1.2486894 -0.0042258 -0.0066549 -0.0049959 1.3677785 0.0821614 0.0089008 -0.0779698 -0.0161547 0.0667666 -0.0216663 -0.0659797 0.0233091 -0.0079714 0.0447575 -0.1205348 -0.0082925 -0.0409018 0.0247717 -0.0056087 -0.0051382 -0.010045 0.1221014 0.067421 0.0050417 0.0861498 -0.0244827 0.0669293 0.0252391 0.0720819 -0.0197229 0.0084729 0.2850901 0.0550658 -0.00225 0.1541402 0.2878159 0.0031774 0.0002566 -0.000364 0.3756969 0.1955709 0.0035949 -0.0078691 0.0685412 0.3417304 0.0011512 -0.0060274 -0.0016591 0.3899156 unknown
polarizability: 162.4687967|2.7042011|132.4260677|3.3153672|1.5937456|78.4661164 unknown
InChI: InChI=1S/C5H5Cl3N4O/c1-2-10-3(5(6,7)8)11-4(9)12(2)13/h9H2,1H3
charge 0 multiplicity 1
18 atoms
Cl 2.946049 -1.694002 0.081165
Cl 2.937847 0.905112 -1.450857
Cl 2.84133 0.919711 1.581397
O  -3.30478 0.170602 -0.161409
N  -1.963778 0.169171 -0.107512
N  0.154553 1.269397 0.008576
N  0.069059 -1.14713 -0.061579
N  -2.090009 -2.157323 -0.177398
C  -1.195734 1.334485 -0.044014
C  0.734762 0.0368 -0.001916
C  -1.278376 -1.074641 -0.114048
C  -1.939232 2.628411 -0.038042
C  2.257716 0.016018 0.051044
H  -2.557054 2.724726 -0.949848
H  -1.222949 3.458833 0.02533
H  -2.646767 2.664794 0.810562
H  -3.096824 -1.966989 -0.213051
H  -1.691912 -3.092576 -0.188798
