program: Gaussian 09
title: 000035849
version: EM64L-G09RevD.01
frameworkgroup: C1[X(C24H21NO3S)]
method: RPBEPBE
basis: SDD
operation: Freq
keyword: #p
keyword: freq=noraman
keyword: PBEPBE/SDD
title: #p freq=noraman PBEPBE/SDD
converged: YES YES NO NO
title: Mulliken charges:
elementType: S O O O N C C C C C C C C C C C C C C C C C C C C C C C C H H H H H H H H H H H H H H H H H H H H H
charge: 0.231588 -0.366979 -0.306114 -0.177074 -0.674264 0.134417 0.491270 -0.744412 -0.693753 -0.695496 -0.390579 -0.405945 0.164815 0.209298 0.377144 0.273403 0.255947 -0.231744 -0.487670 -0.126101 -0.223849 -0.279097 -0.215865 0.128249 -0.367507 -0.379960 -0.383276 -0.231920 -0.229070 0.220914 0.215564 0.217933 0.215373 0.212111 0.224687 0.213412 0.217336 0.220970 0.236014 0.255580 0.261621 0.256693 0.255762 0.290016 0.291367 0.321085 0.390306 0.235501 0.235663 0.356637
chargesum: 0.00000
title: Mulliken charges with hydrogens summed into heavy atoms:
elementType: S O O O N C C C C C C C C C C C C C C C C C C C C C C C C
charge: 0.231588 -0.010342 -0.306114 -0.177074 0.037127 0.134417 0.491270 -0.090002 -0.041582 -0.043778 -0.154565 -0.150365 0.164815 0.209298 0.377144 0.273403 0.255947 -0.231744 -0.487670 -0.126101 0.037772 -0.022404 -0.215865 0.128249 -0.111745 -0.089944 -0.091910 0.003581 0.006593
polarizability: 5.49922503e+02 1.93538836e+01 2.98213482e+02 -4.39336887e+01 8.25741107e+00 1.85235692e+02
1716.lowfreq: -2.7824 -0.0017 -0.0007 -0.0005 3.6924 6.2861 12.2995 16.9907 22.1700
frequency: 11.9540 16.9083 22.1568 37.3854 51.5666 60.3182 81.2266 101.8175 131.5706 133.9109 152.5539 168.6888 185.8816 194.8474 213.5452 224.5804 248.8397 260.7750 271.1067 290.9745 302.5649 303.6349 317.3923 333.8144 346.8719 349.8934 373.1907 379.5875 387.1646 406.6222 413.5886 422.6677 423.6626 435.6439 446.6039 452.7416 456.9869 473.8571 491.4825 501.0029 522.6551 548.3063 555.1265 573.4442 615.6814 629.3374 630.2890 653.1862 675.7697 706.2019 723.2085 734.0549 735.4896 745.5254 776.1660 811.3046 833.6823 840.9304 845.3544 847.5896 850.6690 866.7383 871.4998 879.8682 917.8886 931.8813 936.6455 941.5883 957.1722 961.4308 975.4062 998.4242 998.7416 1014.3819 1019.0150 1022.3230 1025.4626 1048.0215 1075.5069 1086.8610 1110.8668 1119.7905 1122.7756 1158.1641 1170.6341 1185.7463 1198.3543 1204.0053 1215.9926 1243.0701 1254.2047 1270.8777 1286.4415 1300.7658 1304.2352 1336.7500 1356.3941 1375.5503 1378.7121 1380.1968 1395.5953 1396.9267 1405.4862 1406.5543 1430.7105 1444.0100 1459.8415 1464.4280 1465.8587 1470.4019 1475.9001 1484.4439 1488.0811 1497.7187 1507.0898 1522.9866 1553.6291 1567.9351 1570.3790 1594.8538 1599.1464 1609.1594 1616.4219 2973.3468 2975.0111 2980.0295 3068.8844 3071.3834 3071.9061 3077.8531 3080.1747 3081.2737 3117.2192 3129.8680 3133.3269 3144.3017 3150.3539 3155.9333 3163.3777 3170.3223 3171.7125 3238.7561 3522.7375 3585.3028
redmass: 6.1777 3.2575 4.9731 7.5599 5.4181 4.2394 4.4500 5.2835 6.0470 6.0291 5.8895 5.7639 1.5234 6.1145 2.4794 3.0431 1.1047 4.2239 3.9479 4.9703 2.6746 1.4230 3.5352 3.0613 5.0249 3.1789 1.6710 2.7234 4.6481 2.9367 3.7875 4.4372 5.5428 4.8566 7.9643 4.3647 3.1228 10.2547 5.0558 3.1565 5.0415 1.7823 2.0363 3.4796 5.2691 5.5793 7.1578 5.9839 5.5878 6.6630 5.6989 3.6377 2.9092 3.6583 7.2208 1.9914 2.5877 1.4483 1.4439 1.2089 1.2433 2.6890 8.1669 7.9254 1.7597 1.6540 2.0073 1.2033 6.5269 1.3301 1.3797 1.3887 4.0974 1.3577 1.4571 2.7659 1.3793 2.0899 3.8428 2.4383 1.9071 1.5376 1.8622 1.6946 1.1637 1.8119 1.1290 2.9478 2.6266 1.8207 1.9200 3.0870 3.8252 1.2901 3.1059 3.6743 4.8437 1.2479 1.2866 7.2318 6.1167 2.8482 4.0621 1.2204 4.6888 2.7836 1.0510 1.0847 1.1102 2.7077 1.3141 1.3509 1.0513 1.1022 5.5495 7.6193 4.6688 2.4225 6.2076 3.6109 5.8795 6.6919 7.3128 1.0353 1.0346 1.0359 1.1007 1.1003 1.0998 1.0997 1.0987 1.0994 1.0912 1.0875 1.0862 1.0890 1.0905 1.0959 1.0945 1.0948 1.0993 1.0629 1.0656 1.0894
irintensity: 0.3055 0.1326 0.0735 5.8620 1.3269 0.4024 0.2781 1.9091 0.3818 0.2162 0.3309 1.5386 0.1146 0.1023 1.0874 3.8540 0.4380 6.0227 2.5464 0.1559 1.2800 0.4184 1.5708 2.1519 3.8560 1.2636 43.9473 29.8365 33.2404 1.0077 0.1193 11.5430 15.6611 15.9506 3.6870 1.3171 0.3841 10.6926 4.7255 7.4399 11.9935 67.9936 63.5737 7.2707 14.8232 11.5864 0.0320 8.9478 2.2399 8.3704 12.7953 2.0586 12.6394 23.5862 21.1744 44.6955 3.9031 33.0132 30.7458 107.8870 17.7355 0.2998 19.9982 29.4909 3.4148 2.5756 0.0925 0.2301 20.6392 0.3170 0.0395 4.4354 60.9758 0.0466 18.6570 73.7343 0.4165 83.4642 1.9545 4.8464 36.0987 20.9258 12.5868 60.4322 20.4920 27.6845 4.4018 6.0290 1.5102 57.1778 26.9357 51.1428 652.7346 3.6888 106.9569 40.6235 1.7021 18.7479 18.1159 98.3827 56.4060 15.5117 43.9244 8.2535 53.3073 23.4144 0.1892 2.3261 6.4382 3.3505 24.4273 20.9922 11.8680 47.7009 114.1668 423.0175 22.3797 82.8089 4.5310 51.6843 7.0532 2.7933 12.4841 28.9011 30.5216 29.7075 10.1762 8.6905 3.1339 38.1338 127.3515 53.8799 3.7090 13.6892 4.8753 3.7973 13.5494 8.8239 4.2417 11.2144 37.6092 69.4237 27.8507 100.3464
temp: 298.150 k
press: 1.00000 atm
elementType: 16 8 8 8 7 6 6 6 6 6 6 6 6 6 6 6 6 6 6 6 6 6 6 6 6 6 6 6 6 1 1 1 1 1 1 1 1 1 1 1 1 1 1 1 1 1 1 1 1 1
symmnumber: 1
zpe: 1015190.3 jmol-1
zpe.correction: 0.386666 hartree
zpe.thermalcorrener: 0.412810 hartree
zpe.thermalcorrenthalpy: 0.413754 hartree
zpe.thermalcorrgfe: 0.328798 hartree
zpe.sumelectzpe: -1603.632766 hartree
zpe.sumelectthermal: -1603.606622 hartree
zpe.sumelectthermalent: -1603.605677 hartree
zpe.sumelectthermalfe: -1603.690634 hartree
dipole: 5.9136 0.6543 0.6873
dipole: 5.9893
quadrupole: -143.9400 -184.8296 -174.7246
quadrupole: -7.9062 -7.2834 -2.6820
quadrupole: 23.8914 -16.9982 -6.8932 -7.9062 -7.2834 -2.6820
hfenergy: -1604.0194312 hartree
pointgroup: C01 [X(C24H21N1O3S1)]
dipole: 2.3289006 0.1817209 0.309228 debye
polarizability: 552.3234397|10.5021013|297.3291492|-37.3998127|9.1533289|183.7190886 unknown
InChI: InChI=1S/C24H21NO3S/c1-24(2,3)13-8-10-14(11-9-13)29-18-12-17(26)19-20(21(18)25)23(28)16-7-5-4-6-15(16)22(19)27/h4-12,26H,25H2,1-3H3
charge 0 multiplicity 1
50 atoms
S  1.594827 2.352485 -0.716483
O  -0.648212 -2.373212 -1.240301
O  -3.678315 2.60955 0.704432
O  -3.211875 -2.713539 -0.723496
N  -1.194064 3.042565 0.219864
C  6.540206 -1.137518 0.831674
C  5.314119 -0.291724 0.415972
C  7.638689 -1.162357 -0.261802
C  7.15774 -0.53971 2.132573
C  6.085728 -2.603887 1.10446
C  4.21503 -0.15315 1.31221
C  5.223664 0.371683 -0.833527
C  -2.230199 0.831403 -0.092113
C  -2.099788 -0.563457 -0.462962
C  -1.092471 1.7225 -0.144341
C  -4.696528 0.459421 0.429842
C  -4.577235 -0.907065 0.061342
C  3.017884 1.262411 -0.272621
C  0.171284 1.18929 -0.587483
C  -3.525236 1.369394 0.362084
C  3.084257 0.62005 0.986074
C  4.085883 1.137592 -1.184343
C  -3.273475 -1.481824 -0.402981
C  -0.82466 -1.035861 -0.877989
C  0.287299 -0.150816 -0.945374
C  -5.947669 0.967666 0.866181
C  -5.712189 -1.753485 0.132343
C  -7.069436 0.120967 0.934899
C  -6.951146 -1.245234 0.566443
H  8.490141 -1.775099 0.085766
H  7.271173 -1.607649 -1.204962
H  8.024574 -0.149339 -0.47993
H  6.432915 -0.534259 2.966068
H  8.031276 -1.140252 2.447994
H  7.493572 0.500326 1.967823
H  6.949947 -3.215726 1.423724
H  5.322389 -2.654868 1.901341
H  5.657029 -3.060398 0.19349
H  4.243148 -0.645418 2.291047
H  6.040196 0.295926 -1.557032
H  2.259163 0.722758 1.698494
H  4.032261 1.631053 -2.160421
H  1.259873 -0.530854 -1.283372
H  -6.006295 2.024814 1.141747
H  -5.588329 -2.801139 -0.158967
H  -0.359827 3.627791 0.257371
H  -2.13355 3.356026 0.525858
H  -8.034282 0.515243 1.271871
H  -7.825255 -1.903373 0.619818
H  0.297365 -2.5312 -1.498005
