program: Gaussian 09
title: 000035506
version: EM64L-G09RevD.01
frameworkgroup: C1[X(C12H21N3O3)]
method: RPBEPBE
basis: SDD
operation: Freq
keyword: #p
keyword: freq=noraman
keyword: PBEPBE/SDD
title: #p freq=noraman PBEPBE/SDD
converged: YES YES NO NO
title: Mulliken charges:
elementType: O O O N N N C C C C C C C C C C C C H H H H H H H H H H H H H H H H H H H H H
charge: -0.264181 -0.261221 -0.283884 -0.117569 -0.126868 -0.106583 -0.395173 -0.447175 -0.441038 0.285407 0.287756 0.299023 -0.505939 -0.494800 -0.492305 -0.675278 -0.669627 -0.671163 0.245229 0.328687 0.300651 0.251986 0.250696 0.272711 0.223543 0.275132 0.221988 0.226226 0.228332 0.230331 0.207760 0.228398 0.232090 0.205412 0.238749 0.233792 0.209345 0.228743 0.240816
chargesum: 0.00000
title: Mulliken charges with hydrogens summed into heavy atoms:
elementType: O O O N N N C C C C C C C C C C C C
charge: -0.264181 -0.261221 -0.283884 -0.117569 -0.126868 -0.106583 0.178744 0.105462 0.082370 0.285407 0.287756 0.299023 -0.007265 -0.046586 -0.033642 -0.007031 0.008326 0.007741
polarizability: 1.76234970e+02 -3.13051274e+00 1.67107916e+02 1.17313434e+00 2.75539080e+00 1.32335456e+02
1716.lowfreq: -13.1027 -9.0626 -4.6793 0.0005 0.0006 0.0007 28.6916 32.5621 42.5860
frequency: 28.1851 32.5211 42.5605 52.8806 64.0084 68.8535 94.8696 100.1864 105.0613 155.6595 163.9819 185.5684 197.3996 200.9801 209.1997 262.4506 271.4233 304.3706 313.7029 326.4103 348.5983 361.6228 394.2855 438.0048 479.9953 515.5727 526.2457 544.0405 548.6207 566.3001 595.7076 612.8524 669.7298 744.9152 749.2929 809.2847 812.9362 813.9397 837.1809 905.7525 926.3424 942.3062 971.9261 987.6895 1009.9371 1013.4786 1026.7111 1062.5391 1074.3558 1077.4035 1079.2757 1082.6660 1083.1702 1107.3225 1120.1506 1167.1111 1176.9172 1203.6329 1218.9495 1226.8456 1252.5664 1258.7983 1263.9375 1306.3113 1309.5831 1329.1830 1337.0150 1354.2980 1365.0654 1391.7193 1395.1433 1396.1786 1396.8990 1399.2092 1401.7110 1442.9693 1448.4330 1452.5021 1466.2233 1467.4691 1468.2259 1471.0031 1473.6154 1478.5208 1479.0665 1479.5152 1482.6431 1589.1557 1596.9993 1615.0936 2953.5536 2963.8228 2964.9487 2969.4882 2970.4269 2981.0403 2999.0919 3001.3630 3002.2778 3016.1100 3022.0905 3022.9453 3095.5586 3098.3280 3098.5737 3105.6685 3108.2545 3111.5932 3111.9809 3145.7081 3149.2021
redmass: 3.8158 3.9251 4.1000 4.7372 4.3195 5.6113 1.8069 1.9491 1.6657 3.9029 2.8585 3.5534 1.2902 1.2390 1.3491 3.6331 3.8724 3.4292 3.5776 3.0282 3.3277 3.8351 4.9738 1.8125 3.5739 3.3309 4.5359 2.7009 2.7792 3.3651 4.7254 4.7452 4.1788 3.9121 3.8288 1.3477 1.3520 1.3524 4.0914 3.7252 3.9012 2.5856 2.1513 1.9942 1.6719 1.6431 1.6839 2.4277 1.6292 1.6110 2.5419 2.2553 1.7611 4.9154 2.8692 2.2883 2.0384 3.7163 6.1711 1.1473 1.1822 1.1778 1.1750 1.6288 1.6130 1.4928 1.2890 1.2373 1.2161 2.2537 1.3843 1.3131 1.4598 1.6797 1.8048 1.0998 1.0898 1.0964 1.0396 1.0398 1.0410 1.0809 1.0846 1.0594 1.0545 1.0640 1.1285 7.3576 7.9666 8.3752 1.0724 1.0687 1.0590 1.0595 1.0606 1.0711 1.0363 1.0365 1.0365 1.0998 1.0990 1.0994 1.1001 1.1001 1.1003 1.1002 1.0942 1.1004 1.1002 1.0927 1.0904
irintensity: 0.7370 0.2491 2.0778 1.2502 2.5319 1.7541 2.0196 2.8014 2.5751 0.6820 0.1505 0.7318 0.9588 0.8937 0.9628 1.5080 11.7741 3.1328 7.2700 3.9804 4.8966 8.6975 15.1326 13.7802 0.6254 7.7313 5.3838 2.2153 1.6351 11.3132 1.9232 2.3511 8.0273 8.7563 11.3751 5.2296 8.8975 12.1677 59.8745 30.0111 43.1125 75.3201 55.9714 41.2645 6.8592 5.8997 13.5590 32.5288 2.3020 0.5146 22.8520 13.4714 6.9040 3.5660 22.3185 216.2819 350.0312 156.9114 46.7529 11.6314 5.8451 0.4702 1.3578 11.2846 4.9344 20.7458 0.3547 2.8994 23.4574 75.1929 2.1748 73.5238 31.7449 82.1427 88.7335 50.3380 5.8425 34.1845 11.3137 14.6154 16.2868 20.5812 10.3070 9.8422 10.8083 6.1189 40.0179 265.6754 5.8463 331.7318 34.4317 48.6500 37.8995 24.9506 18.9014 65.9931 32.0327 26.9145 29.6971 15.3593 14.2003 4.8418 25.6503 13.4179 38.6488 27.9071 6.5275 19.4500 31.3950 3.2293 5.1690
temp: 298.150 k
press: 1.00000 atm
elementType: 8 8 8 7 7 7 6 6 6 6 6 6 6 6 6 6 6 6 1 1 1 1 1 1 1 1 1 1 1 1 1 1 1 1 1 1 1 1 1
symmnumber: 1
zpe: 858170.8 jmol-1
zpe.correction: 0.326860 hartree
zpe.thermalcorrener: 0.346865 hartree
zpe.thermalcorrenthalpy: 0.347809 hartree
zpe.thermalcorrgfe: 0.276698 hartree
zpe.sumelectzpe: -858.408064 hartree
zpe.sumelectthermal: -858.388059 hartree
zpe.sumelectthermalent: -858.387115 hartree
zpe.sumelectthermalfe: -858.458226 hartree
dipole: 2.9605 4.6634 4.1281
dipole: 6.8959
quadrupole: -102.8462 -130.3830 -103.3205
quadrupole: 7.9192 -1.7841 -6.2279
quadrupole: 9.3370 -18.1997 8.8627 7.9192 -1.7841 -6.2279
hfenergy: -858.7349236 hartree
pointgroup: C01 [X(C12H21N3O3)]
dipole: -1.5501946 1.6321191 -1.5145094 debye
polarizability: 174.5174138|4.653404|169.021877|1.5945309|-0.3043767|132.1390505 unknown
InChI: InChI=1S/C12H21N3O3/c1-4-10(16)13-7-14(11(17)5-2)9-15(8-13)12(18)6-3/h4-9H2,1-3H3
charge 0 multiplicity 1
39 atoms
O  2.51215 -1.959388 0.548463
O  -1.393906 -3.037396 0.294349
O  0.765619 2.844158 0.28839
N  1.434222 -0.549726 -0.948283
N  -0.933215 -1.08017 -0.864733
N  -0.203079 1.22787 -1.063771
C  0.413655 -1.568397 -1.256694
C  1.131286 0.768206 -1.524323
C  -1.264987 0.256811 -1.399182
C  2.417958 -0.810729 0.029356
C  -1.764397 -1.883813 -0.066904
C  -0.28151 2.239034 -0.094339
C  3.364308 0.343251 0.386815
C  -3.139177 -1.308603 0.319942
C  -1.674943 2.601164 0.438985
C  4.395131 -0.071723 1.451916
C  -3.950688 -2.298451 1.175394
C  -1.644477 3.86664 1.315638
H  0.422675 -1.776027 -2.346971
H  0.63327 -2.488145 -0.69362
H  1.871384 1.522802 -1.233466
H  1.094659 0.6812 -2.62897
H  -1.320328 0.193508 -2.506908
H  -2.235776 0.596198 -1.02201
H  3.885685 0.680479 -0.532483
H  2.770766 1.209785 0.739847
H  -2.997611 -0.359877 0.876642
H  -3.705073 -1.054479 -0.599487
H  -2.374172 2.740578 -0.409219
H  -2.062046 1.74643 1.03097
H  5.059814 0.778087 1.689609
H  5.009887 -0.918113 1.102251
H  3.892501 -0.396242 2.378379
H  -4.927522 -1.860004 1.447706
H  -3.405586 -2.556485 2.09817
H  -4.123118 -3.239751 0.627729
H  -2.651315 4.079763 1.716699
H  -1.302899 4.740405 0.735573
H  -0.944546 3.74075 2.15764
