program: Gaussian 09
title: 000035501
version: EM64L-G09RevD.01
frameworkgroup: C1[X(C5Cl6N6)]
method: RPBEPBE
basis: SDD
operation: Freq
keyword: #pfreq=noraman
keyword: PBEPBE/SDD
title: #p freq=noraman PBEPBE/SDD
converged: NO YES NO NO
title: Mulliken charges:
elementType: Cl Cl Cl Cl Cl Cl N N N N N N C C C C C
charge: 0.128889 0.150483 0.137216 0.134092 0.159906 0.123934 0.107028 0.051983 -0.012497 0.010998 0.068566 0.018064 0.289350 0.269265 -0.780526 -0.780449 -0.076302
chargesum: 0.00000
title: Mulliken charges with hydrogens summed into heavy atoms:
polarizability: 1.86283830e+02 -3.14488424e+01 1.92599622e+02 -1.35632074e-01 8.42248356e-02 1.13100855e+02
1716.lowfreq: -5.9168 -0.0018 0.0018 0.0022 0.9057 4.5104 8.6775 12.8391 53.9726
frequency: 8.4304 11.7828 53.9679 74.7735 79.1968 84.8703 109.3471 150.0592 178.2951 192.0204 195.1571 213.7353 220.3671 227.0150 251.6653 277.7632 307.6537 310.1448 339.1741 377.8029 398.7033 457.2036 486.6005 498.7105 608.0407 643.6848 645.2859 659.7019 733.2078 737.0904 768.7719 777.2189 785.7841 840.7455 900.0019 944.5815 1002.1301 1150.3739 1198.8754 1291.1541 1300.2818 1416.2065 1431.5952 1460.9246 2075.3283
redmass: 28.4205 30.0964 20.4519 21.1543 16.3712 19.9512 19.4555 29.0331 33.2452 17.3589 17.9014 18.0427 20.3542 23.8752 26.5679 25.4441 24.9697 21.6328 20.6896 31.0247 22.2614 14.2103 14.0024 14.1087 13.5074 13.6107 13.1548 13.2205 12.8505 12.4936 12.1908 12.6513 12.6979 12.6235 13.9647 13.1450 12.7956 13.0828 12.9787 12.3469 12.2764 12.6579 12.8273 12.8456 13.9959
irintensity: 0.0130 0.0144 0.0826 0.1114 0.6236 0.0699 0.0894 0.8617 0.0261 0.3296 0.2042 0.0862 0.5494 0.1887 0.5495 0.0212 2.1159 1.7898 1.4945 0.2862 0.1996 1.6255 1.6945 2.7048 0.4012 60.1796 130.1473 103.0890 130.5825 168.2941 3.8325 38.6043 59.2066 2.6541 10.8239 17.0578 38.6460 3.4390 22.2037 7.6249 145.6438 433.6426 258.6674 575.1864 407.7378
temp: 298.150 k
press: 1.00000 atm
elementType: 17 17 17 17 17 17 7 7 7 7 7 7 6 6 6 6 6
symmnumber: 1
zpe: 160750.7 jmol-1
zpe.correction: 0.061227 hartree
zpe.thermalcorrener: 0.078519 hartree
zpe.thermalcorrenthalpy: 0.079463 hartree
zpe.thermalcorrgfe: 0.010962 hartree
zpe.sumelectzpe: -3278.060347 hartree
zpe.sumelectthermal: -3278.043055 hartree
zpe.sumelectthermalent: -3278.042111 hartree
zpe.sumelectthermalfe: -3278.110612 hartree
dipole: -1.0142 1.5368 -0.1103
dipole: 1.8445
quadrupole: -144.8703 -138.5824 -133.4524
quadrupole: -2.7848 -0.0615 0.1272
quadrupole: -5.9019 0.3859 5.5160 -2.7848 -0.0615 0.1272
hfenergy: -3278.1215738 hartree
pointgroup: C01 [X(C5Cl6N6)]
dipole: 0.2032009 0.6966681 0.0008019 debye
dipolederiv: -0.2147325 0.0953134 0.0529404 0.0808748 -0.3030335 -0.2856646 0.0223359 -0.2497672 -0.5468265 -0.4015676 -0.2712337 -0.0288283 -0.2690782 -0.3504348 -0.0252214 -0.0173446 -0.0234207 -0.1135642 -0.1809503 0.0539816 -0.0188241 0.0366503 -0.3027813 0.297159 0.0226147 0.2529519 -0.5253482 -0.1858666 -0.030823 -0.0206386 -0.0361733 -0.3354007 0.3006745 -0.0491255 0.2496538 -0.5170365 -0.5321988 0.2662339 0.0164272 0.2352359 -0.2470758 -0.0099809 0.0053363 -0.0126356 -0.1059934 -0.2183299 -0.052858 0.0212275 -0.0595551 -0.3294138 -0.2911919 0.0419961 -0.2502193 -0.5630504 -1.3994885 -0.0042946 -0.0578259 -0.1388996 -0.47798 0.0316469 -0.0428483 0.0256436 -0.0721638 -0.5629139 -0.5431655 0.024904 -0.2519127 -1.3080775 0.0610393 0.0056285 0.0722749 -0.1674834 -0.5221676 0.6083297 -0.061532 -0.0010393 -1.2010757 0.0661218 -0.0180303 0.1080632 -0.1566211 -0.6105785 -0.8550624 0.0487806 -0.5324018 -1.716151 0.0961126 0.0244057 0.0885044 -0.1582455 0.8523091 1.3472482 -0.0752196 0.6959881 1.1735932 -0.054535 -0.0282358 -0.0328156 0.119531 -0.2657556 -0.5744293 0.0330576 -0.3309927 -0.6406372 0.0352455 0.017277 0.0291412 -0.0086088 1.0191647 -0.2989756 0.0540267 -0.1161079 0.7443389 -0.0485305 -0.0026862 -0.0450257 -0.0010153 0.9583799 0.2799789 0.0331654 0.3580248 0.9820083 -0.0433954 0.0762134 -0.0198618 -0.0107614 0.7960549 0.2196466 -0.0043811 0.3314912 0.9667203 0.0207342 0.0021942 0.005744 1.2517939 0.9865013 -0.2719891 -0.0236136 -0.3394015 0.8908886 -0.0100631 -0.0405801 -0.0241007 1.2510339 0.4821398 0.032099 0.0063339 0.3372972 2.4545121 -0.1401511 -0.0191511 -0.1741304 0.3243598 unknown
polarizability: 169.1759886|24.4092552|209.2318103|0.4319337|-6.1687966|113.5765077 unknown
InChI: InChI=1S/C5Cl6N6/c6-4(7,8)1-13-2(5(9,10)11)15-3(14-1)16-17-12
charge 0 multiplicity 1
17 atoms
Cl 2.608256 -2.080759 -1.348992
Cl 3.766619 0.184464 0.277191
Cl 2.426928 -2.120791 1.682565
Cl -2.420081 -2.602398 1.490934
Cl -4.084929 -0.55006 0.044909
Cl -2.43461 -2.516515 -1.546117
N  -0.063845 -1.187455 0.09999
N  -1.468874 0.773192 -0.09998
N  0.957936 0.995279 -0.01752
N  -0.493094 2.895303 -0.22242
N  0.548996 3.638839 -0.243618
N  1.346395 4.500372 -0.284302
C  1.013937 -0.355932 0.086262
C  -1.274363 -0.56449 0.005387
C  2.388013 -1.032213 0.177112
C  -2.502681 -1.483889 0.008285
C  -0.314604 1.506951 -0.109386
