program: Gaussian 09
title: 000000632
version: EM64L-G09RevD.01
frameworkgroup: C1[X(C7H9NO4)]
method: RPBEPBE
basis: SDD
operation: Freq
keyword: #pfreq=noraman
keyword: PBEPBE/SDD
title: #p freq=noraman PBEPBE/SDD
converged: YES YES NO NO
title: Mulliken charges:
elementType: O O O O N C C C C C C C H H H H H H H H H
charge: -0.403308 -0.218427 -0.377872 -0.231154 0.029010 -0.440245 -0.428534 -0.257260 -0.485626 0.016363 0.190571 0.133527 0.222775 0.245237 0.215686 0.235434 0.276084 0.264613 0.249159 0.380827 0.383140
chargesum: 0.00000
title: Mulliken charges with hydrogens summed into heavy atoms:
elementType: O O O O N C C C C C C C
charge: -0.022481 -0.218427 0.005268 -0.231154 0.029010 0.027768 0.022586 0.018824 0.028146 0.016363 0.190571 0.133527
polarizability: 1.19587828e+02 -6.75498014e+00 9.22694910e+01 -5.45708831e+00 3.33414018e+00 6.85416376e+01
1716.lowfreq: -13.7478 -9.1652 -0.0008 -0.0005 0.0002 12.2999 32.1301 39.9357 67.7629
frequency: 32.0840 39.8867 67.7343 91.0180 159.2207 219.6371 251.1070 290.4094 327.8997 351.9261 423.3704 463.2496 474.3743 543.6022 603.3731 604.5094 626.0981 637.3831 696.6875 723.8644 771.6616 818.8766 858.9973 888.4927 903.8299 959.8502 1017.7849 1044.4402 1067.1963 1076.9448 1100.6811 1136.4118 1152.0085 1198.7411 1227.7998 1246.0811 1287.1966 1318.0955 1322.7145 1338.9193 1348.3979 1369.5802 1441.9745 1465.8953 1474.4653 1614.3769 1618.9733 1669.2602 2987.0465 2991.6416 3001.7241 3015.2697 3055.5525 3060.3525 3069.9721 3504.7964 3508.8605
redmass: 10.9350 9.2444 3.4929 4.9052 4.9816 3.9662 2.5541 4.0306 5.7180 6.4627 2.9835 3.5454 4.2091 3.4004 2.2337 1.4734 2.4511 1.9900 3.1510 4.4810 3.3099 3.1586 2.4391 2.1027 2.6551 3.7334 3.6296 2.0984 2.7602 2.1153 1.7709 1.7161 1.4951 1.4436 1.4246 1.2490 1.1990 1.7016 1.8640 1.4937 1.6261 2.5107 1.0973 1.0848 1.0872 9.5623 8.6719 8.7986 1.0683 1.0626 1.0606 1.0835 1.0933 1.0996 1.1032 1.0639 1.0639
irintensity: 1.4825 2.0089 3.2926 0.0554 3.6364 5.2261 4.5497 1.3660 2.4779 6.8056 4.8127 14.7103 1.8741 24.9780 71.1146 116.5677 96.1969 19.5969 49.1418 40.1416 15.0063 2.5121 1.4107 4.4836 50.3330 23.1048 190.5210 176.2769 48.2606 60.6554 1.0283 48.8682 24.3565 5.9259 1.8805 2.4614 6.7170 44.8463 61.8908 4.4856 7.5423 6.6786 23.2996 13.3140 8.8654 236.7161 7.6599 202.2849 4.0971 35.0166 17.4710 3.0637 14.3979 21.8393 31.5108 24.4972 36.0224
temp: 298.150 k
press: 1.00000 atm
elementType: 8 8 8 8 7 6 6 6 6 6 6 6 1 1 1 1 1 1 1 1 1
symmnumber: 1
zpe: 416074.9 jmol-1
zpe.correction: 0.158475 hartree
zpe.thermalcorrener: 0.169899 hartree
zpe.thermalcorrenthalpy: 0.170844 hartree
zpe.thermalcorrgfe: 0.119395 hartree
zpe.sumelectzpe: -626.873801 hartree
zpe.sumelectthermal: -626.862376 hartree
zpe.sumelectthermalent: -626.861432 hartree
zpe.sumelectthermalfe: -626.912880 hartree
dipole: 1.0521 1.3729 -1.3184
dipole: 2.1748
quadrupole: -68.5816 -60.7840 -73.7247
quadrupole: 2.9282 -2.2651 -1.2075
quadrupole: -0.8848 6.9127 -6.0279 2.9282 -2.2651 -1.2075
hfenergy: -627.0322753 hartree
pointgroup: C01 [X(C7H9N1O4)]
dipole: -0.4729089 0.6357113 0.3230253 debye
dipolederiv: -0.7146529 -0.1608185 0.4440871 -0.212209 -0.461413 0.3578636 0.3840158 0.2720749 -0.801805 -0.5247147 -0.19036 -0.080456 -0.2610638 -0.5146839 -0.2034677 0.0083889 -0.0232011 -0.8839408 -0.2559453 0.0838084 -0.0587508 0.1705912 -1.1034936 0.3230284 -0.0947861 0.313518 -0.5163881 -0.9699915 -0.229962 0.1576454 0.0691319 -0.6312934 0.1394089 0.0605052 0.1689975 -0.3947992 -0.1131407 -0.0552916 0.0040533 -0.2396536 -0.4472413 0.0797398 -0.0244429 0.0459564 -0.3194661 -0.1062798 -0.0615179 -0.0311535 -0.0181914 0.0046326 0.0594274 -0.0654653 -0.0053358 0.0454515 0.0469807 -0.0031127 0.0144489 -0.0237277 0.0638156 0.0084069 0.0114566 0.0583698 0.156426 -0.0091631 -0.1360354 -0.0114774 -0.059068 0.1053915 -0.0447383 0.0516608 -0.0462866 0.1666964 -0.078648 -0.0369727 0.0451371 -0.0356379 -0.1366298 0.1499621 0.0695789 0.197656 0.0660655 -0.1094008 0.1010955 -0.0557376 0.1331875 0.4312797 -0.1923071 -0.0209469 -0.2258426 0.1777994 0.9969527 0.5933571 -0.2703336 0.7596032 0.6885659 -0.0402725 -0.3047282 -0.0534425 1.3880176 1.2963427 0.0680319 -0.1385307 -0.2915388 1.2240117 -0.4625398 -0.0129569 -0.4661088 0.4167979 -0.1219366 0.1036555 0.0099412 0.1284723 0.0139615 0.0114127 0.013956 -0.0082078 0.0816763 0.087758 -0.0076941 0.0252078 -0.0078635 0.0530458 -0.0788572 -0.0148814 -0.0309345 -0.0706271 0.0287136 0.0130599 0.0074108 -0.0037395 0.0471766 -0.0552079 0.0040517 -0.1329352 -0.1292057 0.0506697 -0.0104473 0.0002758 -0.0009659 -0.1108355 0.102006 -0.0032621 0.1366274 0.0068706 0.0199053 0.019253 0.0221507 0.090714 0.0703067 -0.0287723 -0.0109647 -0.0235092 -0.0341642 -0.0255618 -0.0580643 -0.0519477 -0.0633128 0.0678581 -0.0072182 -0.0651629 -0.0413217 0.0837182 0.095072 0.0353453 0.0033161 0.0036112 0.0361799 -0.0416732 0.0545949 -0.0252315 -0.0730401 0.3140587 -0.1075167 -0.0543941 -0.1100681 0.2438551 -0.0909903 -0.089022 -0.1210159 0.2529737 0.0929821 0.0401866 0.019107 -0.028271 0.3555097 0.0147886 0.0484104 0.0101732 0.3809433 unknown
polarizability: 119.0656807|7.4301381|89.2645441|-4.9817039|-9.6739305|72.0687317 unknown
InChI: InChI=1S/C7H9NO4/c9-6(10)4-2-1-3-5(8-4)7(11)12/h4,9,11H,1-3H2
charge 0 multiplicity 1
21 atoms
O  -3.01061 -1.173947 1.081279
O  -2.441745 -1.099416 -1.169862
O  2.305576 -1.676347 0.900118
O  3.510455 0.07055 -0.035569
N  0.011682 -0.268032 0.607634
C  -1.327141 1.606749 -0.55019
C  -0.089165 2.498767 -0.312158
C  -1.307137 0.415909 0.434711
C  1.198813 1.672979 -0.512732
C  1.09304 0.311715 0.163463
C  -2.285915 -0.681526 -0.004436
C  2.409792 -0.417079 0.325758
H  -2.262214 2.180905 -0.417041
H  -1.322271 1.216706 -1.585428
H  -0.114339 2.906682 0.717579
H  -0.097579 3.36198 -1.000838
H  -1.612895 0.731519 1.450527
H  2.092091 2.195679 -0.127171
H  1.396798 1.510356 -1.591638
H  -3.602104 -1.916871 0.779763
H  3.217567 -2.073579 0.959029
