program: Gaussian 09
title: 000035592
version: EM64L-G09RevD.01
frameworkgroup: C1[X(C21H15N3S3)]
method: RPBEPBE
basis: SDD
operation: Freq
keyword: #p
keyword: freq=noraman
keyword: PBEPBE/SDD
title: #p freq=noraman PBEPBE/SDD
converged: YES YES NO NO
title: Mulliken charges:
elementType: S S S N N N C C C C C C C C C C C C C C C C C C C C C H H H H H H H H H H H H H H H
charge: 0.299973 0.311460 0.303995 0.100246 0.118610 0.057757 -0.161864 -0.167233 -0.164380 -0.338028 -0.365352 -0.344412 -0.253733 -0.221842 -0.183607 -0.183649 -0.217383 -0.252588 -0.212989 -0.208866 -0.200394 -0.199791 -0.209738 -0.213085 -0.234316 -0.224888 -0.233828 0.254330 0.253222 0.254175 0.254438 0.252646 0.254916 0.231768 0.231654 0.228159 0.228379 0.231823 0.231814 0.230573 0.231552 0.230477
chargesum: 0.00000
title: Mulliken charges with hydrogens summed into heavy atoms:
elementType: S S S N N N C C C C C C C C C C C C C C C C C C C C C
charge: 0.299973 0.311460 0.303995 0.100246 0.118610 0.057757 -0.161864 -0.167233 -0.164380 -0.338028 -0.365352 -0.344412 0.000598 0.031380 0.070568 0.070789 0.035263 0.002328 0.018779 0.022787 0.027765 0.028588 0.022085 0.018729 -0.003742 0.006664 -0.003351
polarizability: 4.41883694e+02 3.83278019e-01 2.78598041e+02 1.05205993e+01 -2.51583798e+01 2.04696269e+02
1716.lowfreq: -7.0267 -4.1799 -2.2212 -0.0017 -0.0007 0.0022 9.6730 11.2280 19.1612
frequency: 9.1509 10.1678 19.0549 22.8324 28.2071 32.8106 34.0551 55.1122 59.6717 121.1994 122.0055 134.9762 147.1800 149.3563 186.6903 200.7221 239.4210 263.0211 268.8565 274.4555 337.4056 378.5722 397.9314 402.0369 402.3169 403.4566 416.3254 432.4779 442.2428 451.3620 498.9986 507.2593 547.2760 607.4052 609.5976 609.7235 610.0315 610.8910 676.7360 676.9139 678.5224 691.9326 692.8988 693.7528 747.3987 754.7328 756.1048 777.9497 779.5834 785.9381 842.5101 845.3101 847.9171 887.5770 920.3019 922.3038 927.8693 973.4030 974.8561 977.9188 984.8923 985.3244 985.9543 996.1199 996.3345 999.2666 1014.3939 1014.5822 1015.9972 1072.3347 1073.1973 1073.6561 1075.1081 1075.8557 1076.5905 1171.6929 1172.2158 1173.0432 1179.0127 1181.6786 1182.8864 1185.4498 1188.2011 1194.3240 1235.6653 1302.1282 1304.1831 1304.8690 1377.7935 1378.0480 1378.4365 1398.8238 1404.3400 1426.6808 1427.7091 1428.3542 1460.8170 1461.0216 1461.4645 1588.8050 1589.3445 1589.5337 1590.8677 1591.3529 1592.7608 3127.8914 3128.3518 3130.2065 3140.4300 3140.7300 3140.8364 3152.1944 3152.7462 3153.1525 3162.4780 3162.9590 3163.0969 3172.2296 3174.2011 3174.4883
redmass: 5.3356 4.0343 4.1326 5.1248 5.4629 8.4592 5.9748 5.1072 6.3642 8.5288 11.2926 6.1227 13.2040 12.4374 5.0577 5.1993 6.3624 6.4116 5.9791 6.0992 10.8251 9.7007 4.9609 2.9600 2.8103 3.6089 11.0883 11.2252 8.8570 4.8468 4.1269 4.5839 6.8267 12.1214 6.6228 6.5114 6.6980 11.1183 6.4289 6.4413 6.7353 2.1295 2.1789 2.1075 1.7358 1.5778 1.5964 8.0283 9.0397 12.4775 1.2503 1.2495 1.2460 13.7252 1.3826 1.3738 1.3802 1.3987 1.3943 1.3925 6.4012 6.2765 6.2441 1.3275 1.3276 1.3308 3.4582 3.4055 3.3662 2.2027 2.2044 1.5867 2.2305 1.7764 1.6549 1.0527 1.0533 1.0536 3.4955 1.2866 2.2661 1.1385 2.4779 6.3238 11.7184 1.3057 1.3086 1.3043 9.9197 10.2451 10.1868 11.8745 11.5035 2.1198 2.0915 2.1365 2.1027 2.1203 2.0953 6.1067 6.1066 6.0785 6.2969 6.3761 6.4497 1.0851 1.0851 1.0850 1.0889 1.0889 1.0887 1.0934 1.0933 1.0932 1.0970 1.0977 1.0976 1.1015 1.0999 1.0999
irintensity: 0.3647 0.1323 0.0816 0.2430 0.2076 0.0492 0.5951 0.3458 0.7554 0.7061 0.0686 1.1308 0.3141 0.6501 1.8349 0.8066 1.0823 0.2620 0.0353 0.0414 1.0105 4.8757 3.3955 0.0457 0.0255 1.1643 0.1003 0.3403 4.6206 7.9918 2.3040 32.9247 5.2449 0.2745 0.0772 0.3695 0.3410 1.5747 8.6487 2.5824 6.0257 95.3261 10.0386 45.1800 59.5145 4.1778 36.6680 167.8210 210.9580 2.1149 0.2355 2.0767 0.2914 0.9160 4.4196 0.4769 3.4338 2.3343 1.2663 0.1841 27.8052 4.1098 7.4548 0.3229 0.2782 0.1860 13.0581 22.5413 23.6237 13.0648 8.5165 7.8742 9.2333 4.5267 5.6758 0.1020 0.3602 0.0010 117.9818 98.5619 18.9834 16.5095 82.5007 359.6033 21.6881 0.8790 3.1164 3.7416 2.8047 1.8302 0.8106 719.3535 1308.6794 15.4771 10.1524 13.2761 6.9798 14.4031 22.3990 1.1064 9.0236 3.0455 2.3955 1.9242 1.1215 0.7619 0.2868 0.2378 4.8883 9.2464 6.5170 9.7937 25.3924 19.8183 18.6282 27.4813 20.6055 17.0618 10.0862 4.6289
temp: 298.150 k
press: 1.00000 atm
elementType: 16 16 16 7 7 7 6 6 6 6 6 6 6 6 6 6 6 6 6 6 6 6 6 6 6 6 6 1 1 1 1 1 1 1 1 1 1 1 1 1 1 1
symmnumber: 1
zpe: 792608.5 jmol-1
zpe.correction: 0.301889 hartree
zpe.thermalcorrener: 0.326025 hartree
zpe.thermalcorrenthalpy: 0.326969 hartree
zpe.thermalcorrgfe: 0.240726 hartree
zpe.sumelectzpe: -2165.792834 hartree
zpe.sumelectthermal: -2165.768697 hartree
zpe.sumelectthermalent: -2165.767753 hartree
zpe.sumelectthermalfe: -2165.853997 hartree
dipole: 2.5306 3.4007 0.2076
dipole: 4.2440
quadrupole: -143.7386 -185.1725 -164.5875
quadrupole: -3.7325 2.5837 -8.6906
quadrupole: 20.7609 -20.6729 -0.0880 -3.7325 2.5837 -8.6906
hfenergy: -2166.0947226 hartree
pointgroup: C01 [X(C21H15N3S3)]
dipole: 0.8972425 1.4080586 0.0184648 debye
polarizability: 441.283051|12.1163768|277.6718962|8.4204903|-27.1145108|206.2230566 unknown
InChI: InChI=1S/C21H15N3S3/c1-4-10-16(11-5-1)25-19-22-20(26-17-12-6-2-7-13-17)24-21(23-19)27-18-14-8-3-9-15-18/h1-15H
charge 0 multiplicity 1
42 atoms
S  -0.640413 2.131422 -0.173951
S  -3.675299 -2.365702 -0.225746
S  1.618413 -2.947494 -0.385976
N  -1.976368 -0.17972 -0.209618
N  0.43836 -0.429982 -0.278964
N  -0.990906 -2.39156 -0.298229
C  1.163716 2.525362 -0.235544
C  -4.837912 -0.928541 -0.157262
C  3.116758 -1.866587 -0.370379
C  -0.701912 0.313098 -0.230768
C  -2.055637 -1.537353 -0.246076
C  0.227013 -1.777218 -0.309977
C  1.622431 3.328397 -1.303378
C  -5.361908 -0.405224 -1.358803
C  3.391256 -0.98448 -1.438416
C  2.032314 2.138824 0.808659
C  -5.241888 -0.420814 1.096223
C  4.037692 -2.036661 0.687169
C  2.971432 3.755311 -1.321176
C  -6.300921 0.650468 -1.302222
C  4.601446 -0.257046 -1.439348
C  3.380675 2.556434 0.774795
C  -6.180471 0.635347 1.144968
C  5.25541 -1.316021 0.669777
C  3.850451 3.369453 -0.28376
C  -6.709701 1.170982 -0.052369
C  5.537351 -0.426239 -0.391622
H  0.936282 3.615841 -2.106684
H  -5.038456 -0.813578 -2.321409
H  2.66776 -0.860177 -2.249128
H  1.664774 1.5134 1.627053
H  -4.826379 -0.841295 2.017324
H  3.807253 -2.722011 1.509301
H  3.328728 4.384586 -2.143702
H  -6.708898 1.063354 -2.23119
H  4.810846 0.439677 -2.257993
H  4.06129 2.24611 1.574688
H  -6.49479 1.036905 2.114399
H  5.975916 -1.452312 1.483752
H  4.895093 3.699893 -0.298717
H  -7.437214 1.989277 -0.011536
H  6.480311 0.131773 -0.403764
