program: Gaussian 09
title: 000035539
version: EM64L-G09RevD.01
frameworkgroup: C1[X(C21H15N3S)]
method: RPBEPBE
basis: SDD
operation: Freq
keyword: #p
keyword: freq=noraman
keyword: PBEPBE/SDD
title: #p freq=noraman PBEPBE/SDD
converged: YES YES NO NO
title: Mulliken charges:
elementType: S N N N C C C C C C C C C C C C C C C C C C C C C H H H H H H H H H H H H H H H
charge: 0.289576 -0.068413 0.001555 0.047515 0.285122 0.291149 -0.033104 -0.050402 -0.418046 -0.352385 -0.341589 -0.351847 -0.341387 -0.230278 -0.234680 -0.229996 -0.232585 -0.164668 -0.226902 -0.226428 -0.224926 -0.219755 -0.212519 -0.216365 -0.230046 0.268631 0.284317 0.268799 0.280387 0.229768 0.230207 0.229585 0.231034 0.230762 0.231129 0.255120 0.254626 0.232482 0.232571 0.231986
chargesum: 0.00000
title: Mulliken charges with hydrogens summed into heavy atoms:
elementType: S N N N C C C C C C C C C C C C C C C C C C C C C
charge: 0.289576 -0.068413 0.001555 0.047515 0.285122 0.291149 -0.033104 -0.050402 -0.418046 -0.083753 -0.057272 -0.083048 -0.061000 -0.000510 -0.004473 -0.000411 -0.001550 -0.164668 0.003860 0.004701 0.030195 0.034871 0.019962 0.016207 0.001940
polarizability: 4.19454112e+02 2.87142866e+01 3.04836943e+02 7.25199797e-01 -1.55722470e+00 1.37950197e+02
1716.lowfreq: -6.2093 -0.0011 -0.0009 -0.0008 1.0634 4.8372 10.7917 20.1903 34.7256
frequency: 10.3318 20.1626 34.7098 36.2797 38.3687 64.5482 72.5855 100.2588 103.9542 150.1102 192.5574 205.9859 220.7377 229.0691 260.9617 274.8207 331.0939 370.4460 402.8353 403.9946 405.4226 411.6612 442.1967 451.3790 469.5696 495.3195 574.7170 609.9484 612.9610 615.0249 626.9925 644.5760 655.8101 677.8388 679.2353 695.1453 701.8487 704.8265 757.8418 768.9654 803.9780 805.7310 814.1170 844.7224 850.3554 865.5543 868.3527 909.1781 929.2568 958.6319 960.7775 979.2029 985.2790 989.2062 990.3187 999.7180 999.8031 1002.3875 1011.0955 1012.3208 1014.2931 1019.3707 1020.8717 1065.8834 1073.2461 1075.3611 1075.9312 1080.1051 1121.4598 1171.9521 1172.5052 1172.5709 1175.6214 1177.7689 1180.2881 1183.4459 1203.0989 1302.2934 1307.9133 1311.6848 1330.7055 1376.5998 1379.6694 1390.9050 1394.8404 1413.5843 1427.0594 1431.4034 1450.3390 1451.8114 1460.9371 1484.5684 1494.8658 1587.0513 1588.5784 1589.1317 1591.3203 1611.5763 1612.9643 3127.7436 3128.4161 3129.1248 3140.0719 3141.4544 3141.6599 3152.5831 3155.1053 3156.1421 3162.1659 3167.2936 3169.1516 3171.5701 3174.0925 3175.3015
redmass: 4.0408 5.5438 5.7137 3.7345 4.0112 6.5972 5.3863 6.7054 6.2441 11.6619 4.8694 6.6057 5.4368 5.5598 6.1307 6.0961 7.9958 8.3035 2.8138 2.8498 2.8664 7.9204 3.6838 9.6946 3.6729 4.3228 8.1604 6.4787 6.5659 6.4688 7.9858 7.8570 7.2133 4.9864 6.8604 2.1604 1.7981 1.5202 1.5440 2.0398 2.3224 9.6225 7.4741 5.1480 1.2668 1.2459 1.2441 13.2860 1.3794 1.4396 1.4396 1.3901 6.4252 6.2655 6.2528 1.3771 1.3215 1.3730 1.3347 1.3337 3.3892 2.7323 2.2704 2.8072 1.5919 1.5865 2.0614 1.8757 3.9002 1.0907 1.0613 1.0539 4.6673 1.2480 1.2034 1.1147 5.4727 1.3054 1.4659 1.4133 3.9332 10.1936 4.8490 9.6093 6.7309 4.1799 2.0870 3.3649 3.9375 3.0470 2.1535 2.6266 3.2006 6.3660 6.3066 6.1846 6.4176 6.1357 6.1867 1.0854 1.0854 1.0850 1.0887 1.0894 1.0895 1.0933 1.0941 1.0944 1.0968 1.0953 1.0948 1.1013 1.0992 1.0990
irintensity: 0.0902 0.5292 0.2408 0.0429 0.2126 0.7374 0.6958 0.0369 0.2899 0.0186 0.9584 0.0806 0.3585 0.0959 0.1140 0.0563 2.6337 0.8130 0.0354 0.0059 0.0051 3.7320 0.0080 0.5159 8.4133 13.4233 2.4175 0.1927 2.0848 0.0633 32.8961 5.2973 21.7495 0.0010 8.2692 43.6823 103.5847 0.4653 54.9619 108.2206 0.0273 90.3397 5.9075 0.9756 0.2258 0.0398 0.0919 0.1896 2.9487 0.6604 6.3772 0.1910 14.6961 1.6325 0.9850 0.0255 0.1152 0.0670 0.3965 0.5119 19.9482 2.8634 25.9084 47.1366 7.8633 5.5325 0.3621 2.0773 2.3208 4.2947 0.2616 0.0058 10.3424 51.2621 71.2313 1.3158 234.1773 0.8963 7.7882 38.5601 133.9243 1.6348 145.4982 27.8414 3.3189 484.9860 11.7777 431.1265 560.3123 405.3049 12.9540 39.8467 17.6417 0.6198 5.0807 1.3190 1.1062 28.3699 12.3442 0.2082 0.0250 0.1863 6.9434 9.8911 18.2133 20.0634 25.4136 24.5087 19.0469 8.0128 8.5627 15.9251 28.6403 22.0322
temp: 298.150 k
press: 1.00000 atm
elementType: 16 7 7 7 6 6 6 6 6 6 6 6 6 6 6 6 6 6 6 6 6 6 6 6 6 1 1 1 1 1 1 1 1 1 1 1 1 1 1 1
symmnumber: 1
zpe: 791751.6 jmol-1
zpe.correction: 0.301562 hartree
zpe.thermalcorrener: 0.321906 hartree
zpe.thermalcorrenthalpy: 0.322850 hartree
zpe.thermalcorrgfe: 0.248050 hartree
zpe.sumelectzpe: -1369.864636 hartree
zpe.sumelectthermal: -1369.844293 hartree
zpe.sumelectthermalent: -1369.843348 hartree
zpe.sumelectthermalfe: -1369.918148 hartree
dipole: 1.0446 2.1362 0.0380
dipole: 2.3782
quadrupole: -117.7982 -143.1663 -151.4347
quadrupole: 3.5612 0.1617 -0.6090
quadrupole: 19.6682 -5.6999 -13.9683 3.5612 0.1617 -0.6090
hfenergy: -1370.1661981 hartree
pointgroup: C01 [X(C21H15N3S1)]
dipole: -0.4326772 0.8284468 -0.0440324 debye
polarizability: 420.5668367|-25.4507258|303.3508866|10.3775595|-2.2364443|138.3235286 unknown
InChI: InChI=1S/C21H15N3S/c1-4-10-16(11-5-1)19-22-20(17-12-6-2-7-13-17)24-21(23-19)25-18-14-8-3-9-15-18/h1-15H
charge 0 multiplicity 1
40 atoms
S  -1.084581 -2.992646 -0.046746
N  1.454115 0.770108 -0.069195
N  1.236872 -1.642137 -0.013832
N  -0.743585 -0.249163 -0.109458
C  -0.545564 2.190048 -0.161493
C  3.467037 -0.630736 0.024512
C  0.085922 0.851019 -0.111624
C  1.992659 -0.492897 -0.021393
C  -0.109844 -1.446275 -0.059716
C  0.25774 3.362111 -0.164324
C  -1.961372 2.307928 -0.205951
C  4.295125 0.524058 0.018924
C  4.06149 -1.920709 0.074099
C  -0.347705 4.634048 -0.21077
C  -2.561881 3.582273 -0.252592
C  5.697367 0.388744 0.062508
C  5.464081 -2.051014 0.117514
C  -2.813822 -2.344858 -0.135111
C  -1.758302 4.748193 -0.255146
C  6.286025 -0.898025 0.111861
C  -3.447056 -2.23417 -1.392111
C  -3.503124 -2.026561 1.055286
C  -4.788727 -1.791298 -1.457537
C  -4.843743 -1.58261 0.983131
C  -5.486888 -1.464598 -0.271549
H  1.345334 3.25022 -0.129965
H  -2.56245 1.393368 -0.202718
H  3.819058 1.508079 -0.019705
H  3.407112 -2.797395 0.077524
H  0.274791 5.535518 -0.212601
H  -3.653331 3.669511 -0.286964
H  6.332544 1.281321 0.058078
H  5.918233 -3.047138 0.155591
H  -2.227495 5.738001 -0.291444
H  7.376564 -1.001455 0.145459
H  -2.89746 -2.485927 -2.304584
H  -2.997606 -2.120198 2.021486
H  -5.283563 -1.70282 -2.430846
H  -5.382224 -1.332587 1.90381
H  -6.526948 -1.123632 -0.32401
