program: Gaussian 09
title: 000035552
version: EM64L-G09RevD.01
frameworkgroup: C1[X(C8H6Cl9N5O2)]
method: RPBEPBE
basis: SDD
operation: Freq
keyword: #p
keyword: freq=noraman
keyword: PBEPBE/SDD
title: #p freq=noraman PBEPBE/SDD
converged: YES YES NO NO
title: Mulliken charges:
elementType: Cl Cl Cl Cl Cl Cl Cl Cl Cl O O N N N N N C C C C C C C C H H H H H H
charge: 0.063962 0.161397 0.139294 0.065051 0.161525 0.139343 0.114345 0.135630 0.108399 -0.355051 -0.355002 -0.309514 -0.304468 -0.096861 -0.077239 -0.047141 -0.046067 -0.046053 0.116573 0.093865 -0.638984 -0.639225 0.332613 -0.766805 0.335598 0.336409 0.341000 0.341264 0.347929 0.348214
chargesum: 0.00000
title: Mulliken charges with hydrogens summed into heavy atoms:
elementType: Cl Cl Cl Cl Cl Cl Cl Cl Cl O O N N N N N C C C C C C C C
charge: 0.063962 0.161397 0.139294 0.065051 0.161525 0.139343 0.114345 0.135630 0.108399 -0.007122 -0.006788 0.031486 0.036796 -0.096861 -0.077239 -0.047141 0.289531 0.290356 0.116573 0.093865 -0.638984 -0.639225 0.332613 -0.766805
polarizability: 3.00838947e+02 -5.78398103e-01 2.17823497e+02 -2.71836153e+01 5.92434068e-02 1.78014214e+02
1716.lowfreq: -2.1757 -0.0036 -0.0036 -0.0033 3.9224 5.6025 6.5268 20.1592 21.2892
frequency: 5.4186 20.0920 21.2852 24.3134 33.8413 39.2763 44.0407 74.2234 82.6440 92.1751 135.7039 140.2192 151.7544 158.7175 171.1742 172.6758 193.3995 195.6692 218.8774 230.4793 235.1611 242.9340 249.9960 252.4232 263.5880 279.0213 293.4894 295.8893 328.7055 346.6417 356.1576 366.1919 375.2448 380.3334 381.3606 424.6331 470.9756 494.9518 521.6577 553.7683 575.1484 620.9621 633.7534 646.6578 651.5813 679.4535 720.2176 731.2589 753.1735 755.0182 763.1397 765.4705 773.8944 818.3334 821.0579 902.5649 947.4845 953.6182 983.6463 1011.1370 1025.1447 1050.9242 1110.2941 1112.2791 1224.6182 1245.1967 1253.6666 1257.0241 1296.2533 1319.2321 1385.2913 1397.5580 1398.3478 1407.8623 1456.9301 1499.7547 1529.6924 1569.7575 3095.6547 3096.1857 3508.9745 3509.3405 3530.5742 3532.7406
redmass: 33.6162 17.4010 16.9743 19.3235 28.0733 17.5453 22.5690 13.0759 17.8007 10.6007 14.0676 15.6421 20.0784 18.4746 12.6008 13.2137 7.6992 16.7049 19.3510 15.5049 18.4362 9.1816 11.9583 14.1384 17.7900 14.6161 12.9978 13.7717 4.2129 11.0826 1.2783 1.8186 19.2539 9.0762 6.2825 5.6830 4.5388 5.3291 5.9342 3.5616 5.5532 8.2515 9.4675 5.9326 1.6238 1.4569 7.7992 5.9130 12.0052 11.1669 9.7765 10.1181 9.2507 11.9052 6.8483 13.5620 5.2466 4.5250 9.0069 7.8797 6.4275 8.8041 3.6945 3.6119 1.6607 1.3840 1.7007 3.2775 1.4812 2.2218 2.5663 1.1165 1.1190 2.6555 2.9031 3.7784 5.2441 5.0512 1.0857 1.0857 1.0656 1.0656 1.0768 1.0768
irintensity: 0.0082 0.0094 0.1116 0.0537 0.0139 0.0003 0.1748 0.4112 0.2662 0.2082 1.4791 0.0868 0.8941 0.0872 2.4992 4.8331 0.4481 0.3122 0.1509 0.5516 0.1285 1.4893 0.1681 8.1068 0.1024 0.2315 0.7979 0.5704 36.0632 14.8040 0.5229 215.6164 0.1654 0.8748 55.4847 12.2894 1.7115 55.3167 42.9719 73.2871 190.3850 118.2530 2.1423 49.0726 13.1054 269.2951 148.0931 28.2695 30.0580 24.4502 0.3491 311.1031 313.9074 11.3600 10.3987 8.6200 7.2438 215.6323 233.2408 21.4162 32.3515 16.2351 57.8588 63.7875 7.5648 145.2239 46.5334 109.7915 29.9196 5.5774 130.3165 15.4175 9.1105 208.7410 38.5931 320.3716 2083.5816 106.8895 43.7967 41.5588 24.2653 18.3182 52.2341 97.5430
temp: 298.150 k
press: 1.00000 atm
elementType: 17 17 17 17 17 17 17 17 17 8 8 7 7 7 7 7 6 6 6 6 6 6 6 6 1 1 1 1 1 1
symmnumber: 1
zpe: 410558.2 jmol-1
zpe.correction: 0.156373 hartree
zpe.thermalcorrener: 0.183147 hartree
zpe.thermalcorrenthalpy: 0.184091 hartree
zpe.thermalcorrgfe: 0.092736 hartree
zpe.sumelectzpe: -4871.356611 hartree
zpe.sumelectthermal: -4871.329838 hartree
zpe.sumelectthermalent: -4871.328893 hartree
zpe.sumelectthermalfe: -4871.420249 hartree
dipole: 0.2132 -5.0126 -0.0007
dipole: 5.0171
quadrupole: -205.7655 -199.3942 -202.0742
quadrupole: 0.3220 -2.9535 0.0193
quadrupole: -3.3542 3.0171 0.3371 0.3220 -2.9535 0.0193
hfenergy: -4871.5129844 hartree
pointgroup: C01 [X(C8H6Cl9N5O2)]
dipole: 0.0702371 1.9726254 -0.0018381 debye
polarizability: 303.036238|1.1484132|217.8351795|21.5109359|0.2169931|175.8052401 unknown
InChI: InChI=1S/C8H6Cl9N5O2/c9-6(10,11)1-18-4(20-2(23)7(12,13)14)22-5(19-1)21-3(24)8(15,16)17/h2-3,20-21,23-24H
charge 0 multiplicity 1
30 atoms
Cl -4.892289 2.906146 -0.04465
Cl -6.305899 0.219951 0.074852
Cl -4.225834 0.895254 2.150831
Cl 4.89617 2.938045 0.044284
Cl 6.317724 0.25603 -0.073728
Cl 4.234777 0.923557 -2.149389
Cl -0.735002 -3.68201 -1.61138
Cl 1.669062 -3.834221 0.201849
Cl -1.092295 -3.675377 1.402586
O  -3.99096 0.519274 -1.944699
O  4.001973 0.550663 1.946475
N  -2.312728 1.115792 -0.290675
N  2.321292 1.138192 0.291706
N  0.003341 1.171093 0.001168
N  1.214048 -0.940824 0.152828
N  -1.183264 -0.951669 -0.148438
C  -3.584894 0.468149 -0.554012
C  3.596698 0.496381 0.555796
C  -1.134101 0.421291 -0.145453
C  1.145833 0.438161 0.14788
C  -4.695629 1.059694 0.368395
C  4.704972 1.091288 -0.367182
C  0.021217 -1.557525 0.002716
C  -0.0065 -3.093563 0.000755
H  -3.47182 -0.605873 -0.335823
H  3.487797 -0.578259 0.338786
H  -2.24924 2.137278 -0.267283
H  2.253156 2.159501 0.268204
H  -4.173378 1.460396 -2.210814
H  4.181171 1.492583 2.211915
