program: Gaussian 09
title: 000035482
version: EM64L-G09RevD.01
frameworkgroup: C1[X(C7H14O)]
method: RPBEPBE
basis: SDD
operation: Freq
keyword: #pfreq=noraman
keyword: PBEPBE/SDD
title: #p freq=noraman PBEPBE/SDD
converged: YES YES NO NO
title: Mulliken charges:
elementType: O C C C C C C C H H H H H H H H H H H H H H
charge: -0.443954 -0.497659 -0.365300 0.449598 -0.682434 -0.398835 -0.814724 -0.367459 0.212712 0.189565 0.197178 0.213869 0.212514 0.210155 0.219153 0.243092 0.223608 0.226247 0.230607 0.221107 0.188084 0.332876
chargesum: 0.00000
title: Mulliken charges with hydrogens summed into heavy atoms:
elementType: O C C C C C C C
charge: -0.111079 -0.095382 0.045748 0.449598 -0.040612 -0.155743 -0.134261 0.041732
polarizability: 1.05294080e+02 -7.24328594e+00 7.63028243e+01 2.51425095e+00 -1.87959514e+00 6.50690725e+01
1716.lowfreq: -0.0011 -0.0010 -0.0006 2.6745 11.7100 14.1953 38.7820 65.0534 68.2443
frequency: 38.5409 64.8897 68.2201 113.2869 144.3772 204.8695 224.2992 279.5960 313.5923 350.9813 361.5717 439.8228 501.5445 570.6978 742.5294 795.1837 845.9225 865.6319 906.1978 927.0573 956.5338 990.9628 1029.3283 1055.0480 1070.1473 1098.1661 1131.8571 1149.4033 1216.9133 1230.3006 1278.8317 1284.1331 1287.3215 1337.0266 1350.2806 1380.2669 1389.0683 1396.1186 1457.8378 1466.3265 1468.8810 1474.6580 1476.5152 1481.5144 1486.9559 1679.0932 2958.3193 2970.6815 2973.7007 2981.9831 2982.6357 3016.4019 3040.6199 3042.3587 3054.7617 3072.6508 3074.2573 3091.4521 3094.9151 3551.5743
redmass: 1.8338 2.5058 2.7480 1.5679 1.5736 3.0704 1.1238 2.0081 2.8944 1.2798 2.7091 3.1182 2.4079 2.6110 1.1039 2.7368 1.6074 1.3033 1.6879 3.3365 1.7735 1.5782 1.5869 2.3863 1.9266 2.0873 2.1974 1.1489 1.9534 1.3186 1.2737 1.2344 1.2531 1.4977 1.2389 1.3387 1.2112 1.2633 1.0760 1.0833 1.0579 1.0542 1.0453 1.0811 1.0832 6.5986 1.0612 1.0399 1.0356 1.0615 1.0615 1.0972 1.1008 1.0967 1.0976 1.1014 1.0993 1.0927 1.0938 1.0662
irintensity: 0.2989 0.9828 0.9639 0.6427 1.0867 1.2408 0.2152 23.6646 7.1023 122.7912 4.7926 10.6723 1.2857 6.2449 6.1802 4.2499 11.3499 6.1442 0.0362 134.3327 5.1458 7.1363 0.4616 0.9507 16.7462 9.3120 2.1245 10.0104 7.0948 0.6573 3.2409 1.5488 18.3965 1.8238 20.4544 17.4095 9.7648 27.4703 2.6164 2.5717 7.7799 4.4681 11.4207 13.7233 22.1136 16.9558 23.6584 22.3960 48.4242 42.7550 59.7195 4.0413 23.1628 21.4872 26.7520 81.5009 48.8000 16.1475 43.6114 4.1697
temp: 298.150 k
press: 1.00000 atm
elementType: 8 6 6 6 6 6 6 6 1 1 1 1 1 1 1 1 1 1 1 1 1 1
symmnumber: 1
zpe: 510139.2 jmol-1
zpe.correction: 0.194302 hartree
zpe.thermalcorrener: 0.205060 hartree
zpe.thermalcorrenthalpy: 0.206004 hartree
zpe.thermalcorrgfe: 0.157315 hartree
zpe.sumelectzpe: -349.669717 hartree
zpe.sumelectthermal: -349.658958 hartree
zpe.sumelectthermalent: -349.658014 hartree
zpe.sumelectthermalfe: -349.706703 hartree
dipole: -2.5017 1.3343 -0.4693
dipole: 2.8739
quadrupole: -61.2738 -50.8858 -49.5095
quadrupole: 4.8098 0.1640 0.1960
quadrupole: -7.3841 3.0038 4.3802 4.8098 0.1640 0.1960
hfenergy: -349.8640184 hartree
pointgroup: C01 [X(C7H14O1)]
dipole: -0.9919925 -0.4916605 0.2294303 debye
dipolederiv: -0.6255449 -0.1085908 -0.2376001 -0.1474769 -0.6641348 -0.0589364 -0.3943615 -0.1068591 -0.4213189 -0.0940053 0.0903502 0.0116991 0.0914517 0.0927119 0.0190854 0.1178998 0.0479786 0.0799509 0.0405106 0.0211596 -0.0186283 0.0087066 0.1559171 -0.0137133 -0.1340766 -0.0135676 0.0922976 0.3349562 0.0074971 0.0026896 0.0885105 0.2240135 -0.1697888 0.0222828 -0.20299 -0.0605157 -0.0602833 0.0455508 -0.0157176 0.0695227 0.0779861 0.0006255 0.0545115 -0.0030048 0.0632431 -0.232423 -0.0426869 0.0115727 -0.0291414 -0.1939981 -0.1686314 -0.0018187 -0.1683429 -0.2035839 -0.0539511 -0.0056431 -0.0019359 0.0063144 -0.1213878 0.121509 -0.0459149 0.1044494 0.0325458 0.4674848 0.1264734 0.0441718 0.0455964 0.5413983 0.124332 0.185339 0.1910972 0.4066506 0.0396738 -0.0064401 0.0300463 0.0297639 -0.0548122 0.1406743 -0.0061862 0.0936906 -0.0606879 -0.0441512 -0.0902749 -0.0520491 -0.0898499 -0.0819722 -0.1072366 -0.060329 -0.0730259 0.0303318 0.0559948 0.0124473 0.0004094 0.0042899 -0.0586691 0.1493068 0.0042292 0.1159506 -0.0820571 -0.0196953 -0.0900495 -0.0616845 -0.0652293 -0.0726417 -0.1030394 -0.0338445 -0.0765346 0.0156717 0.0651656 -0.0293795 0.0268736 0.0138304 -0.0401654 0.1319448 -0.03732 0.1464349 -0.0476746 0.0102009 -0.0626718 -0.0504688 -0.1264245 -0.0847192 -0.0890085 -0.0847224 -0.0726585 0.0460794 -0.0741055 0.071394 0.0992576 0.0884088 0.057992 -0.0689117 0.1335094 -0.0814153 -0.0569149 0.0308086 0.0351463 -0.0417622 0.0672622 -0.0293301 0.1318205 -0.0135651 0.131456 0.0607884 -0.1080507 0.1000786 -0.1092795 0.0449257 0.0800083 0.0172616 -0.0746805 0.0285533 0.0630467 0.0017711 -0.0223403 0.1409952 -0.0219777 0.0851654 -0.0229032 0.1503229 0.0328036 -0.0427162 0.0851185 -0.0662439 -0.0478192 -0.083314 -0.0804035 -0.0514036 -0.0312449 -0.1103377 0.0128287 -0.0868549 -0.010619 0.0975254 -0.0476605 0.0568236 -0.0150262 0.0849897 -0.0634436 -0.0649491 0.0553125 -0.0145642 -0.027191 0.0449897 -0.1838405 0.0717839 -0.0567156 0.1120507 -0.025623 0.212068 0.0394067 0.1988955 0.0075014 0.2940584 -0.0397449 0.2216956 -0.0322848 0.1626066 unknown
polarizability: 105.5046666|6.5797567|75.6634726|-3.0649197|-2.8329495|65.497838 unknown
InChI: InChI=1S/C7H14O/c1-3-4-7(2)5-6-8/h5,8H,3-4,6H2,1-2H3
charge 0 multiplicity 1
22 atoms
O  3.209458 1.145915 0.470129
C  -1.316324 -0.141205 -0.62412
C  -2.192412 0.403059 0.539951
C  0.086756 -0.563092 -0.196457
C  -3.604708 0.808273 0.065705
C  1.168354 0.192757 -0.554092
C  0.162951 -1.849033 0.609608
C  2.617393 -0.03787 -0.20275
H  -1.249798 0.639063 -1.407072
H  -1.843341 -1.006976 -1.07899
H  -2.279195 -0.361233 1.337159
H  -1.682704 1.275812 0.993211
H  -3.552347 1.590793 -0.714586
H  -4.143531 -0.057626 -0.363367
H  -4.211182 1.204081 0.900768
H  0.99442 1.097636 -1.156062
H  1.17002 -2.054396 1.00735
H  -0.542603 -1.824877 1.461647
H  -0.130875 -2.713021 -0.019101
H  3.23486 -0.146672 -1.111691
H  2.757909 -0.944363 0.4192
H  2.6056 1.408075 1.211461
