program: Gaussian 09
title: 000035513
version: EM64L-G09RevD.01
frameworkgroup: C1[X(C11H14N6O2)]
method: RPBEPBE
basis: SDD
operation: Freq
keyword: #p
keyword: freq=noraman
keyword: PBEPBE/SDD
title: #p freq=noraman PBEPBE/SDD
converged: YES YES NO NO
title: Mulliken charges:
elementType: O O N N N N N N C C C C C C C C C C C H H H H H H H H H H H H H H
charge: -0.202648 -0.204012 -0.316282 -0.083553 -0.160898 -0.623928 -0.611700 0.017942 0.188974 -0.724762 -0.673078 0.410787 0.207964 -0.016778 -0.496320 -0.358672 0.401884 -0.175350 -0.394676 0.249458 0.234073 0.223468 0.236402 0.238077 0.204450 0.303902 0.270880 0.242177 0.339819 0.337299 0.290568 0.320562 0.323971
chargesum: 0.00000
title: Mulliken charges with hydrogens summed into heavy atoms:
elementType: O O N N N N N N C C C C C C C C C C C
charge: -0.202648 -0.204012 -0.316282 -0.083553 -0.160898 0.053189 0.032833 0.017942 0.188974 -0.017763 0.005851 0.410787 0.207964 -0.016778 -0.192418 -0.087792 0.401884 0.066827 -0.104108
polarizability: 2.77310861e+02 -2.13621571e+00 1.63450309e+02 -2.32122189e+00 8.47721446e+00 1.15074291e+02
1716.lowfreq: -5.5178 -0.0007 -0.0005 -0.0002 2.9838 5.2644 26.0279 43.3168 51.3885
frequency: 25.8031 43.3159 51.3844 85.0945 99.4690 124.7299 170.3757 173.1769 197.5049 220.4225 245.2886 258.3429 269.2341 298.8528 311.8133 317.0687 352.9651 388.4715 392.3350 394.3934 427.5010 434.3008 483.6724 493.1589 513.8030 518.6896 524.3567 536.3264 552.2824 560.3582 616.0454 652.4317 664.4184 685.0470 704.4527 714.1748 725.6554 804.2297 813.2984 816.2012 862.5251 912.7354 923.4032 942.7271 945.2404 964.6234 986.7858 993.0322 995.5072 1043.9398 1080.6920 1085.7805 1105.1553 1122.6232 1131.3446 1173.2316 1194.0284 1213.8184 1237.6548 1270.5849 1290.7513 1371.4598 1372.8410 1376.6582 1389.2022 1400.2532 1422.3729 1437.7150 1448.5058 1462.8679 1467.8718 1475.0360 1477.8199 1541.3714 1570.5559 1576.1143 1605.4784 1615.8434 1622.1025 2983.8632 3002.8675 3081.9919 3095.6700 3104.9985 3113.1482 3148.3461 3167.9352 3189.6671 3191.6091 3547.1046 3566.9416 3700.2479 3728.1548
redmass: 5.1178 5.5457 9.5101 4.7259 5.6202 4.2114 5.1291 4.2078 4.1031 1.3262 3.7896 1.3479 2.2756 2.9326 2.7688 2.9793 3.6419 2.4021 1.2847 1.6752 3.2196 2.9439 3.0992 2.9320 2.6283 5.6904 1.3391 1.4621 5.0379 3.4357 5.1755 6.7814 7.5417 2.6389 4.9413 8.9430 9.4182 3.8041 1.5769 7.4865 3.1026 1.5542 1.5820 1.6741 1.5889 3.1453 4.6579 1.4658 1.3580 3.1443 2.0735 1.5187 1.9070 2.3045 2.0495 1.1352 3.3643 8.1838 3.7908 2.4891 1.8194 1.2600 8.4784 5.9343 1.3447 3.4327 5.2282 3.2279 1.0558 1.0683 1.1489 1.8487 1.2242 2.4307 1.9389 4.4466 4.8663 2.7024 2.2011 1.0352 1.0356 1.0999 1.0999 1.1007 1.0991 1.0880 1.0952 1.0928 1.0953 1.0446 1.0439 1.1049 1.1058
irintensity: 2.5286 0.2705 0.1911 0.5603 1.2540 0.4652 3.8941 2.0052 2.9065 0.6166 1.1894 0.3152 0.4953 1.7495 7.3706 0.9223 5.5261 17.1828 286.1454 33.5725 22.1024 24.0366 48.1469 9.0855 2.4981 4.9720 13.2581 101.5167 2.4533 9.5311 5.5452 2.3762 7.2215 17.9297 27.9896 37.7833 17.7059 24.4561 46.0824 22.2133 3.7215 2.2795 0.6966 0.0747 20.0077 12.0060 2.8349 1.1884 0.4730 9.5941 15.5282 26.2273 1.7500 2.1467 41.8115 11.9647 32.8701 284.3421 27.4470 141.0203 84.1520 49.1904 61.0049 60.7279 37.4286 341.1194 177.2164 55.8838 2.3759 4.2693 32.3817 70.3568 68.5803 245.5859 144.1559 16.3626 367.0222 409.4269 346.0321 16.6750 15.8879 25.6672 13.2438 24.5733 23.3004 9.8489 4.2751 0.6408 8.0797 63.3347 101.6817 43.6575 40.4475
temp: 298.150 k
press: 1.00000 atm
elementType: 8 8 7 7 7 7 7 7 6 6 6 6 6 6 6 6 6 6 6 1 1 1 1 1 1 1 1 1 1 1 1 1 1
symmnumber: 1
zpe: 666279.6 jmol-1
zpe.correction: 0.253772 hartree
zpe.thermalcorrener: 0.271694 hartree
zpe.thermalcorrenthalpy: 0.272638 hartree
zpe.thermalcorrgfe: 0.208032 hartree
zpe.sumelectzpe: -905.063653 hartree
zpe.sumelectthermal: -905.045731 hartree
zpe.sumelectthermalent: -905.044787 hartree
zpe.sumelectthermalfe: -905.109393 hartree
dipole: 2.5672 4.4778 0.1636
dipole: 5.1641
quadrupole: -126.5062 -104.0052 -109.5823
quadrupole: -7.5180 -4.6618 -2.5055
quadrupole: -13.1416 9.3593 3.7823 -7.5180 -4.6618 -2.5055
hfenergy: -905.3174254 hartree
pointgroup: C01 [X(C11H14N6O2)]
dipole: 0.9168352 -0.181822 -1.8039274 debye
polarizability: 275.5219311|-17.0686209|115.7028799|-3.0843316|-3.5482496|164.6106502 unknown
InChI: InChI=1S/C11H14N6O2/c1-11(2)15-9(12)14-10(13)16(11)7-4-3-5-8(6-7)17(18)19/h3-6H,12-13H2,1-2H3
charge 0 multiplicity 1
33 atoms
O  -5.061405 0.574531 0.630086
O  -3.59045 -0.324342 2.122595
N  0.960328 -0.038517 -0.13691
N  3.09398 0.762899 0.83806
N  3.048364 -0.991829 -0.874889
N  1.055205 -1.684321 -1.862486
N  5.037592 0.076393 -0.285037
N  -3.871561 0.22623 0.988806
C  1.676853 0.490205 1.13746
C  1.037367 1.817638 1.585416
C  1.582707 -0.592697 2.246703
C  -0.382078 0.312652 -0.482539
C  1.719876 -0.89587 -0.942821
C  3.677766 -0.021079 -0.057675
C  -1.456279 0.076368 0.410356
C  -0.653411 0.929894 -1.738979
C  -2.756121 0.473077 0.035743
C  -1.968252 1.296742 -2.094804
C  -3.042929 1.079886 -1.205465
H  1.665054 2.220645 2.396328
H  1.04312 2.547695 0.758233
H  0.008438 1.696588 1.962096
H  2.020295 -1.544069 1.895389
H  2.158321 -0.253514 3.125154
H  0.53842 -0.77209 2.561663
H  -1.302591 -0.414719 1.373539
H  0.180689 1.124107 -2.420834
H  -2.153856 1.772928 -3.062885
H  1.634572 -2.270086 -2.459574
H  0.048726 -1.82331 -1.82823
H  -4.069029 1.367878 -1.446004
H  5.587744 0.72888 0.265774
H  5.45674 -0.492994 -1.013769
