program: Gaussian 09
title: 000035463
version: EM64L-G09RevD.01
frameworkgroup: C1[X(C14H8S)]
method: RPBEPBE
basis: SDD
operation: Freq
keyword: #pfreq=noraman
keyword: PBEPBE/SDD
title: #p freq=noraman PBEPBE/SDD
converged: NO NO NO YES
title: Mulliken charges:
elementType: S C C C C C C C C C C C C C C H H H H H H H H
charge: 0.227682 0.223533 0.223528 0.504323 0.504317 -0.345019 -0.345028 -0.455411 -0.455415 -0.443911 -0.443914 -0.323074 -0.323065 -0.224640 -0.224635 0.236679 0.236681 0.242660 0.242661 0.246360 0.246359 0.224666 0.224665
chargesum: 0.00000
title: Mulliken charges with hydrogens summed into heavy atoms:
elementType: S C C C C C C C C C C C C C C
charge: 0.227682 0.223533 0.223528 0.504323 0.504317 -0.345019 -0.345028 -0.218732 -0.218733 -0.201251 -0.201253 -0.076715 -0.076707 0.000027 0.000030
polarizability: 2.58002084e+02 2.45560812e-04 1.88302706e+02 -1.01860991e-03 -1.41175511e-03 6.10597717e+01
1716.lowfreq: -7.2529 -0.0019 -0.0014 -0.0009 10.7805 12.5099 102.4994 179.7102 189.0426
frequency: 102.4994 179.7097 189.0422 244.7024 287.0040 313.4906 390.7457 407.8040 427.2820 483.8298 487.0387 490.7696 506.8308 532.3325 565.7038 568.8254 627.3855 653.4441 712.5286 720.5027 765.7308 768.3929 775.1159 827.7609 842.9703 876.3377 899.1456 907.6479 926.2496 969.5861 975.8974 985.0917 996.7086 1040.4539 1061.2870 1116.5276 1164.3187 1165.4773 1197.4748 1213.4711 1235.2966 1236.3366 1327.1647 1383.4888 1390.4258 1407.7516 1422.0851 1429.1200 1482.5196 1486.8039 1496.0492 1572.9201 1584.8699 1605.2435 1629.9182 3120.9023 3128.7010 3129.0149 3144.7628 3146.7839 3147.3370 3163.8977 3164.2910
redmass: 5.0456 4.1164 6.3311 3.8564 4.9952 5.3515 11.6727 8.8808 3.8610 5.7452 3.7452 9.2583 5.0358 3.9668 7.0140 3.3491 4.2366 7.7378 6.2937 2.9659 1.2397 5.9609 1.3508 4.4799 1.5790 6.6477 1.4165 1.4635 5.4265 1.3290 1.3543 1.3976 6.8673 2.1185 1.8621 2.1589 1.3181 1.2773 1.4271 1.8078 2.1390 1.5096 2.3991 5.7227 2.3254 2.0759 6.7497 2.3596 8.9502 3.4189 4.7981 8.0941 6.3785 7.6135 8.3149 1.0864 1.0864 1.0864 1.0968 1.0927 1.0930 1.0977 1.0977
irintensity: 2.6226 0.0000 7.9601 0.7269 0.0000 4.4707 1.7301 0.8532 0.0000 0.5041 1.1403 0.2964 0.2019 0.3090 4.2782 0.0000 0.0000 0.5465 0.5482 45.6650 49.5968 1.3537 0.0000 0.0000 100.7147 4.5886 0.0000 10.8769 24.0941 0.0000 4.0110 0.0000 1.6561 0.0092 12.7688 1.3260 0.3148 0.3923 15.2443 0.8810 10.2830 0.6979 7.1553 3.7920 13.5706 12.7072 0.0001 27.1770 0.3172 0.5269 6.5399 33.9010 0.0101 2.0520 0.2761 1.3146 2.2307 3.3699 16.7147 20.3414 29.7547 44.4663 1.0954
temp: 298.150 k
press: 1.00000 atm
elementType: 16 6 6 6 6 6 6 6 6 6 6 6 6 6 6 1 1 1 1 1 1 1 1
symmnumber: 1
zpe: 449812.6 jmol-1
zpe.correction: 0.171325 hartree
zpe.thermalcorrener: 0.181299 hartree
zpe.thermalcorrenthalpy: 0.182243 hartree
zpe.thermalcorrgfe: 0.135968 hartree
zpe.sumelectzpe: -935.400667 hartree
zpe.sumelectthermal: -935.390693 hartree
zpe.sumelectthermalent: -935.389749 hartree
zpe.sumelectthermalfe: -935.436024 hartree
dipole: 0.0000 -1.1795 0.0000
dipole: 1.1795
quadrupole: -76.7518 -84.1739 -100.4390
quadrupole: 0.0001 -0.0001 0.0000
quadrupole: 10.3697 2.9477 -13.3174 0.0001 -0.0001 0.0000
hfenergy: -935.5719921 hartree
pointgroup: C01 [X(C14H8S1)]
dipole: 0.0000245 0.4640633 -0.0000058 debye
dipolederiv: -0.3790777 0.0000087 -0.0000046 0.0000068 -0.2109282 0.0000011 -0.0000085 0.000003 0.0504627 -0.0504826 0.059678 -0.0000003 -0.1463202 -0.2568814 -0.0000004 0.0000044 0.0000041 0.0039772 -0.05049 -0.0596922 0.0000028 0.1463231 -0.2568795 0.0000048 0. 0.0000046 0.0039806 0.1507509 -0.1176782 0.0000009 -0.1099864 -0.0603878 -0.0000031 0.0000009 -0.0000043 0.078839 0.1507673 0.1176743 -0.000004 0.1099641 -0.0603958 0.0000061 -0.0000001 0.0000007 0.0788399 0.3242477 0.4146182 0.0000017 0.3942837 0.2989179 0.000004 0.0000023 0.0000058 -0.0785844 0.3242094 -0.414631 0.0000044 -0.3942805 0.2989424 -0.0000117 0.0000029 -0.0000176 -0.0785888 -0.0270314 0.0253508 0.0000054 -0.0356552 0.1537693 0.0000018 0.0000093 0.0000045 -0.1747321 -0.0270258 -0.0253433 -0.0000004 0.0356651 0.1537658 -0.0000039 -0.0000092 -0.0000029 -0.1747324 -0.0531562 0.1294202 0.0000039 0.1133516 -0.0071316 0.0000027 0.0000114 0.0000066 -0.2024709 -0.053176 -0.1294187 0.0000031 -0.1133494 -0.007135 -0.0000077 0.0000018 -0.0000028 -0.2024754 -0.2121676 -0.1578175 0.0000014 -0.1338207 -0.0348113 -0.000002 0.0000004 -0.0000044 -0.1463002 -0.2121566 0.1578404 -0.0000007 0.1338184 -0.0348139 0.0000054 0.0000064 0.0000099 -0.1463007 0.1064783 0.002355 -0.0000072 0.0789471 0.0942037 -0.0000016 -0.000021 -0.0000012 -0.1530706 0.1064887 -0.0023595 -0.0000022 -0.0789395 0.0942127 -0.0000037 0.0000072 -0.000004 -0.1530679 0.0267518 -0.1125826 -0.0000014 -0.0521529 -0.0725728 0. -0.0000042 -0.0000037 0.1544805 0.0267585 0.1125775 -0.0000013 0.0521476 -0.0725718 0.0000023 0.0000007 0. 0.1544814 0.0163771 -0.0634658 -0.0000019 -0.1217694 -0.0501351 -0.000001 -0.0000046 -0.0000025 0.1637585 0.0163822 0.0634638 -0.000001 0.1217651 -0.0501387 0.0000042 -0.0000013 0.0000059 0.1637598 0.060061 0.0443177 -0.0000004 0.0875628 -0.0435822 0.000002 0. 0.0000017 0.168397 0.0600545 -0.0443219 0.0000004 -0.0875675 -0.0435815 0. -0.0000031 -0.0000034 0.1683954 -0.1522786 0.0155997 0.0000022 0.0134278 0.0840665 0. 0.0000098 0. 0.1604763 -0.1522848 -0.0155934 -0.0000009 -0.0134216 0.0840684 0.0000007 -0.0000056 0. 0.1604749 unknown
polarizability: 258.0020839|-0.0010561|188.3027061|0.0010186|-0.0014118|61.0597717 unknown
InChI: InChI=1S/C14H8S/c1-3-9-7-8-10-4-2-6-12-14(10)13(9)11(5-1)15-12/h1-8H
charge 0 multiplicity 1
23 atoms
S  -0.000057 -2.680639 0.000034
C  0.709452 -0.086198 0.000019
C  -0.709454 -0.086181 0.000007
C  1.4648 1.120801 0.000015
C  -1.46476 1.120845 -0.000026
C  1.301562 -1.379677 0.000045
C  -1.301595 -1.379644 0.000005
C  0.696871 2.355871 -0.000013
C  -0.696796 2.355896 -0.000026
C  2.884931 0.987163 0.000028
C  -2.884901 0.987251 -0.000011
C  2.698549 -1.500915 0.000049
C  -2.698585 -1.500832 0.000024
C  3.47103 -0.297918 0.000045
C  -3.471029 -0.297814 0.000011
H  1.238723 3.309357 -0.000003
H  -1.238621 3.309394 -0.000031
H  3.523989 1.877516 0.000036
H  -3.523933 1.87762 -0.000026
H  3.199454 -2.473843 0.000055
H  -3.199526 -2.473742 0.000026
H  4.563645 -0.384226 0.00003
H  -4.563648 -0.384086 0.000006
