program: Gaussian 09
title: 000000630
version: EM64L-G09RevD.01
frameworkgroup: C1[X(C7H10O6)]
method: RPBEPBE
basis: SDD
operation: Freq
keyword: #pfreq=noraman
keyword: PBEPBE/SDD
title: #p freq=noraman PBEPBE/SDD
converged: YES YES NO NO
title: Mulliken charges:
elementType: O O O O O O C C C C C C C H H H H H H H H H H
charge: -0.441973 -0.489673 -0.472206 -0.199588 -0.448835 -0.168538 0.210051 -0.534608 -0.085441 -0.572888 -0.170546 0.146950 0.124374 0.244765 0.277024 0.252395 0.280448 0.273120 0.241587 0.384471 0.380652 0.376326 0.392132
chargesum: 0.00000
title: Mulliken charges with hydrogens summed into heavy atoms:
elementType: O O O O O O C C C C C C C
charge: -0.057502 -0.109022 -0.095879 -0.199588 -0.056703 -0.168538 0.210051 -0.012818 0.166954 -0.019320 0.071042 0.146950 0.124374
polarizability: 1.11615216e+02 1.71219456e+00 7.96480425e+01 2.48093305e+00 6.15025455e-01 8.18020520e+01
1716.lowfreq: -12.4370 -7.5347 -0.0011 -0.0009 -0.0009 11.2754 42.9627 66.5324 98.5241
frequency: 42.9489 66.4809 98.5176 151.3329 174.0069 228.4096 251.3642 290.0201 298.9631 327.5135 361.5911 374.7957 424.4888 471.0098 482.8206 510.8982 560.2501 568.3432 591.8308 595.3502 636.7895 661.1110 681.0490 707.8616 760.4869 806.1430 884.9779 893.6855 902.1337 939.0038 966.5153 1007.0385 1040.3540 1056.5762 1074.6164 1106.8423 1147.2826 1182.8318 1216.4086 1228.7011 1247.2781 1267.2431 1278.8955 1282.7288 1319.8481 1332.4671 1362.8773 1378.0010 1423.5695 1431.8023 1445.7988 1623.8554 1692.5365 2954.1937 3002.4022 3004.0159 3024.5971 3084.8515 3097.5136 3302.7618 3397.7654 3481.9425 3525.6240
redmass: 12.2249 6.5479 8.1351 5.4919 5.8926 5.1583 6.4178 4.3823 4.3041 6.7439 3.4524 3.2619 2.9823 4.5174 4.5183 1.1340 3.3385 1.7544 1.3359 1.9425 2.3000 4.6040 1.4686 5.0608 3.3314 4.3010 2.3806 2.3985 3.0340 4.5492 3.1883 3.8086 2.4616 2.1953 2.1724 3.1485 1.3029 2.6920 1.2535 1.2351 1.5153 1.5955 1.3854 1.5214 1.3887 1.5089 1.5407 1.5757 1.2401 1.2016 1.0915 9.9644 9.5922 1.0814 1.0621 1.0827 1.0646 1.1025 1.0988 1.0673 1.0640 1.0644 1.0644
irintensity: 0.2569 1.5354 1.2902 0.1997 3.1380 17.1172 3.3425 33.0147 12.9173 6.1046 13.6538 4.4501 12.5858 2.1449 13.2807 102.7543 2.3872 91.9056 131.7028 58.8409 24.5434 6.0002 150.5083 27.2943 3.8228 16.4778 13.4124 5.9486 18.9545 39.8459 22.8796 335.0744 47.9049 8.6935 46.2581 47.9015 43.0432 41.2163 17.2445 70.4706 55.3882 3.0755 15.8128 1.2998 32.4536 3.0868 26.2855 34.2400 84.5898 67.8973 29.7214 135.4044 226.6839 23.0930 3.5312 28.3911 23.3492 7.2269 2.8498 215.6709 48.8547 37.1350 30.8919
temp: 298.150 k
press: 1.00000 atm
elementType: 8 8 8 8 8 8 6 6 6 6 6 6 6 1 1 1 1 1 1 1 1 1 1
symmnumber: 1
zpe: 452989.4 jmol-1
zpe.correction: 0.172535 hartree
zpe.thermalcorrener: 0.184852 hartree
zpe.thermalcorrenthalpy: 0.185796 hartree
zpe.thermalcorrgfe: 0.134136 hartree
zpe.sumelectzpe: -723.064807 hartree
zpe.sumelectthermal: -723.052489 hartree
zpe.sumelectthermalent: -723.051545 hartree
zpe.sumelectthermalfe: -723.103205 hartree
dipole: 0.5585 0.4618 -4.8685
dipole: 4.9221
quadrupole: -79.7284 -77.1150 -78.1969
quadrupole: -6.3015 10.8734 -0.7550
quadrupole: -1.3816 1.2317 0.1499 -6.3015 10.8734 -0.7550
hfenergy: -723.2373413 hartree
pointgroup: C01 [X(C7H10O6)]
dipole: -0.2670899 -0.0256471 1.9178437 debye
dipolederiv: -0.4253598 0.0098364 -0.107977 0.0096833 -0.5977123 -0.0918736 -0.0573998 -0.1620183 -0.6880866 -0.4840092 -0.0730398 -0.0796756 -0.1217671 -0.6861815 -0.1171621 -0.0739249 -0.1005399 -0.6745523 -0.8537089 0.0464274 -0.0169391 -0.0124411 -0.3833557 -0.0828808 0.055823 -0.082251 -0.4671824 -0.7841046 0.1674536 -0.1010344 0.1322911 -0.590029 0.1795101 -0.2345982 0.3173042 -0.4134897 -0.4061952 -0.0741993 -0.2074303 -0.0606049 -0.4894028 -0.2411011 -0.1800698 -0.2492397 -1.078997 -0.9119471 0.0980751 0.3366986 -0.0071811 -0.2980619 -0.1184405 0.080878 -0.1308248 -0.6197713 0.0405512 -0.0654054 0.055647 -0.2063027 0.5420275 0.1122764 0.0918228 0.1722258 0.5115061 -0.106357 -0.0152802 -0.0296549 0.0656208 -0.0315344 0.044796 -0.0579024 -0.0417137 -0.0410405 0.2938825 -0.027461 0.1098189 0.051206 0.4545297 0.0368087 0.1165107 0.0563387 0.535922 -0.5492942 0.0960687 -0.014261 -0.0222233 -0.1585878 -0.048506 -0.0857222 0.0164316 -0.002053 0.448986 -0.0457112 0.1222305 -0.1253992 -0.1179586 0.1694224 0.0872534 0.246931 0.1784814 0.9758822 -0.0679039 0.0662672 0.0120638 0.584111 -0.3618669 0.2445148 -0.5149582 0.3452515 1.3255082 -0.0078259 -0.1492696 0.1073993 0.2539944 0.3967046 0.016378 0.411885 1.2805504 0.09159 -0.0260394 0.0033418 -0.018783 0.0960951 -0.0426683 -0.0172377 -0.017158 -0.0824626 0.0266323 0.0686356 0.0181479 0.0596331 -0.0558339 -0.0005277 0.0365244 -0.0279327 0.0939567 -0.0110531 -0.0688816 0.0452554 -0.0523756 -0.0769245 0.0847111 0.0329446 0.0600543 -0.0843309 0.0406968 -0.0115071 0.0226728 -0.0144827 0.0059947 0.0542206 0.0464523 0.0766492 0.0514668 0.1281956 -0.0007758 0.0032535 -0.033485 0.1143726 -0.0300374 0.019331 -0.0559681 -0.0223215 0.014547 -0.0263945 -0.0378008 -0.0301582 0.0278367 -0.053139 -0.0721042 -0.0544944 -0.1040301 0.4260565 0.0376387 -0.0304415 0.0787405 0.3652368 0.0109228 -0.0537249 0.0108313 0.3467863 0.1776473 -0.0088309 -0.0107159 0.0446618 0.4449907 0.0681233 0.0355679 0.0670763 0.2997879 0.4455502 -0.0037254 -0.0094404 0.1238658 0.2215734 0.0458956 -0.1057836 0.0154007 0.2977663 0.0963032 -0.0011542 0.0113068 0.0200382 0.3748196 -0.0151881 0.0744669 -0.0140294 0.3368424 unknown
polarizability: 111.5577248|-1.173801|79.7239764|3.0527553|-0.8003884|81.7836092 unknown
InChI: InChI=1S/C7H10O6/c8-3-1-7(13,6(11)12)2-4(9)5(3)10/h3,5,8,10-11,13H,1-2H2
charge 0 multiplicity 1
23 atoms
O  0.903618 -0.4373 -1.566683
O  -1.34507 -1.766854 -0.834114
O  -3.233539 -0.216206 0.403595
O  -1.97153 1.867699 -0.683543
O  2.678408 0.55043 1.467706
O  3.473675 -0.142976 -0.603795
C  1.008354 -0.081969 -0.164059
C  0.421962 -1.203464 0.748459
C  -1.094552 -1.354894 0.561291
C  0.280961 1.287258 0.101874
C  -1.849386 -0.024364 0.810681
C  -1.217914 1.129218 0.007119
C  2.510586 0.087193 0.142015
H  0.641519 -0.983499 1.808301
H  0.90785 -2.161714 0.491618
H  -1.493762 -2.126812 1.247714
H  0.616754 2.030719 -0.63924
H  0.549781 1.645234 1.114706
H  -1.785534 0.233137 1.890567
H  0.078416 -1.002194 -1.668604
H  -2.319123 -1.633115 -0.995504
H  -3.501908 0.611545 -0.092531
H  3.650233 0.645626 1.658228
