program: Gaussian 09
title: 000035540
version: EM64L-G09RevD.01
frameworkgroup: C1[X(C9H12ClN5S4)]
method: RPBEPBE
basis: SDD
operation: Freq
keyword: #p
keyword: freq=noraman
keyword: PBEPBE/SDD
title: #p freq=noraman PBEPBE/SDD
converged: YES YES NO NO
title: Mulliken charges:
elementType: Cl S S S S N N N N N C C C C C C C C C H H H H H H H H H H H H
charge: 0.037328 0.363976 0.363997 0.039727 0.039736 0.078846 0.078506 0.119278 0.105235 0.105151 -0.596888 -0.589041 -0.595018 -0.587500 -0.536713 -0.537593 -0.306016 -0.305384 -0.315098 0.267873 0.232343 0.256717 0.276896 0.256264 0.229642 0.257624 0.268296 0.230375 0.276218 0.256065 0.229155
chargesum: 0.00000
title: Mulliken charges with hydrogens summed into heavy atoms:
elementType: Cl S S S S N N N N N C C C C C C C C C
charge: 0.037328 0.363976 0.363997 0.039727 0.039736 0.078846 0.078506 0.119278 0.105235 0.105151 0.160044 0.173761 0.161278 0.173939 -0.536713 -0.537593 -0.306016 -0.305384 -0.315098
polarizability: 2.87327202e+02 2.03529391e-01 2.00205211e+02 -1.40233776e-01 -9.26472152e+00 1.84609132e+02
1716.lowfreq: -19.9951 -12.9102 -7.3893 -0.0023 -0.0023 -0.0018 10.7950 24.9120 37.8833
frequency: -10.3800 24.0868 36.8649 40.3879 67.0846 70.4660 73.1837 76.8999 88.7157 100.3091 129.4283 145.8762 149.6523 154.3528 156.1282 159.4556 176.2853 273.5872 277.4748 278.4827 279.3071 295.6238 306.4285 362.7680 374.4064 390.0639 426.3363 428.8963 432.1135 433.4318 466.7293 531.9266 533.4579 563.1169 581.1095 607.7212 613.3766 772.1650 780.2254 782.9478 829.7475 831.0346 883.1774 930.0292 937.6011 1039.4895 1041.3684 1083.3819 1084.5617 1138.4241 1142.8941 1144.3856 1149.6423 1163.2722 1183.2023 1203.9289 1208.0626 1214.1149 1237.5115 1383.5990 1389.5014 1392.6694 1413.7569 1417.7425 1417.9663 1453.4896 1454.1728 1463.4320 1464.9933 1470.5620 1477.3539 1479.7548 1491.2774 1518.3731 1519.2603 2974.3006 2978.7064 2990.2607 2991.8086 3068.6839 3072.7053 3083.4095 3084.1470 3122.8027 3123.4971 3129.1565 3130.0955
redmass: 3.3673 6.7076 4.8514 4.2465 1.8335 4.9109 3.2536 1.7862 1.6873 3.9051 3.6366 1.5091 4.9434 12.4403 1.7538 5.5782 3.4107 5.5972 3.8099 5.2002 4.8029 7.0639 5.3005 5.6759 14.1773 7.2573 13.3019 5.8129 3.4927 3.5906 10.2011 4.5861 4.6275 9.2122 10.9956 12.2805 12.3258 12.9075 12.7621 13.6877 6.2103 5.9954 13.6771 4.8976 5.1670 1.6293 1.6110 1.2317 1.2290 1.5707 1.4295 1.5858 1.8584 9.1410 10.9824 4.9989 3.7777 5.9853 11.1157 2.5622 4.0907 1.8339 3.2883 1.4585 1.1387 1.0788 1.0844 1.1486 1.1189 1.0642 1.0453 1.0617 1.1462 1.6399 1.5605 1.0367 1.0359 1.0372 1.0369 1.0994 1.0999 1.0993 1.0994 1.1002 1.1001 1.1003 1.1001
irintensity: 1.9044 0.0412 2.9425 3.6623 0.1150 0.7754 9.2752 0.4630 0.6438 1.2866 0.5245 0.0456 1.1612 0.0801 0.6818 0.1793 3.1864 0.8887 16.8023 0.9766 2.7037 2.7939 8.7698 1.0584 0.5045 3.5572 11.6358 1.0261 2.8961 5.8731 2.1670 3.7655 2.6986 0.0559 13.2086 0.0219 1.1678 104.5120 2.1099 254.9280 18.6557 45.3088 7.0036 19.7828 164.0864 2.2739 14.9479 0.6620 1.8582 8.6698 3.9919 9.9981 135.5389 86.8572 302.1518 65.9245 25.0351 59.2504 2.7682 353.9763 416.0297 91.3632 603.8990 192.7272 75.2707 15.1702 1.6532 45.6833 4.4639 9.3357 9.8669 36.3307 0.1657 188.8507 58.9794 15.3238 48.1886 51.8746 7.0610 18.6634 5.2193 34.6990 7.6661 3.6038 4.6093 2.8092 3.2028
temp: 298.150 k
press: 1.00000 atm
elementType: 17 16 16 16 16 7 7 7 7 7 6 6 6 6 6 6 6 6 6 1 1 1 1 1 1 1 1 1 1 1 1
symmnumber: 1
zpe: 555331.5 jmol-1
zpe.correction: 0.211515 hartree
zpe.thermalcorrener: 0.233094 hartree
zpe.thermalcorrenthalpy: 0.234038 hartree
zpe.thermalcorrgfe: 0.158438 hartree
zpe.sumelectzpe: -2674.756405 hartree
zpe.sumelectthermal: -2674.734826 hartree
zpe.sumelectthermalent: -2674.733882 hartree
zpe.sumelectthermalfe: -2674.809482 hartree
dipole: 4.5885 -0.0704 -0.0116
dipole: 4.5890
quadrupole: -151.6846 -159.1487 -141.9970
quadrupole: -0.1997 0.0225 21.0117
quadrupole: -0.7411 -8.2053 8.9464 -0.1997 0.0225 21.0117
hfenergy: -2674.9679199 hartree
pointgroup: C01[X(C9H12Cl1N5S4)]
dipole: 1.1094835 1.3457595 0.4665638 debye
polarizability: 225.8505827|43.7285945|246.1520262|24.3564235|10.6212343|200.1389365 unknown
InChI: InChI=1S/C9H12ClN5S4/c1-14(2)8(16)18-6-11-5(10)12-7(13-6)19-9(17)15(3)4/h1-4H3
charge 0 multiplicity 1
31 atoms
Cl -3.38522 -3.904965 -1.482816
S  1.15801 -2.358789 0.906829
S  -2.182614 1.319763 -1.464729
S  1.79495 0.045256 2.720203
S  0.493452 2.776598 -1.90018
N  2.666661 -0.161277 0.116357
N  -0.748172 2.58894 0.549691
N  -0.571358 -0.585945 -0.299975
N  -2.618533 -1.328437 -1.377281
N  -1.149359 -2.945728 -0.333475
C  3.388802 1.130538 0.225849
C  2.642802 -0.71616 -1.258112
C  0.318503 3.404132 1.182264
C  -1.70958 2.009332 1.51817
C  1.955944 -0.644351 1.173597
C  -0.6891 2.290574 -0.778122
C  -0.329719 -1.895775 -0.005681
C  -1.729449 -0.360867 -0.984291
C  -2.259298 -2.579115 -1.011942
H  2.836466 1.909447 -0.333308
H  4.397195 1.014234 -0.20872
H  3.466662 1.416492 1.284696
H  1.871507 -0.19433 -1.854265
H  2.432747 -1.795014 -1.242662
H  3.628521 -0.550555 -1.723702
H  0.890505 3.927046 0.40213
H  0.99259 2.746738 1.763407
H  -0.150616 4.136473 1.862187
H  -1.257072 1.12646 2.006173
H  -2.643407 1.717009 1.017648
H  -1.937219 2.766577 2.286763
