program: Gaussian 09
title: 000035459
version: EM64L-G09RevD.01
frameworkgroup: C1[X(C10H10O2)]
method: RPBEPBE
basis: SDD
operation: Freq
keyword: #pfreq=noraman
keyword: PBEPBE/SDD
title: #p freq=noraman PBEPBE/SDD
converged: YES YES NO NO
title: Mulliken charges:
elementType: O O C C C C C C C C C C H H H H H H H H H H
charge: -0.205591 -0.217341 0.262713 0.145855 -0.368260 -0.335969 0.102665 0.139271 -0.216366 -0.245462 -0.737268 -0.789036 0.262970 0.246039 0.239084 0.236765 0.241311 0.227074 0.265386 0.243108 0.238801 0.264251
chargesum: 0.00000
title: Mulliken charges with hydrogens summed into heavy atoms:
elementType: O O C C C C C C C C C C
charge: -0.205591 -0.217341 0.262713 0.145855 -0.105290 -0.089930 0.102665 0.139271 0.022718 -0.008697 -0.003496 -0.042876
polarizability: 1.39158723e+02 -2.36755191e+00 1.31856868e+02 3.62474056e+00 2.34243956e+00 6.52185253e+01
1716.lowfreq: -5.9872 -0.0010 -0.0009 -0.0009 2.6300 8.7493 37.9678 84.4732 100.1618
frequency: 37.8870 84.4424 100.1610 103.1649 152.2922 158.0560 195.9863 234.6181 299.1709 338.3586 359.7869 410.5976 471.1290 533.6956 564.8147 579.1173 596.3660 613.8804 681.9798 755.5569 763.2539 770.7420 883.0356 951.0758 956.0268 968.5630 999.2411 1008.7288 1025.1451 1035.7817 1045.4996 1087.7517 1132.1396 1180.3431 1239.3086 1277.7535 1281.1459 1371.0697 1372.9152 1377.4090 1427.1593 1439.0537 1448.2714 1451.3353 1462.2242 1470.0641 1558.7256 1589.3276 1595.6715 1603.1593 2983.4676 2987.8465 3073.0654 3085.0298 3127.1291 3133.1175 3134.4302 3145.0656 3156.4039 3170.4884
redmass: 4.6611 1.4161 3.2388 3.1979 3.7477 1.0850 3.2568 3.9738 4.3468 5.1891 4.2604 3.2882 4.1404 3.7854 4.1375 3.3184 2.7272 3.7759 4.7422 3.8909 4.0989 1.3427 1.3713 2.1387 1.7411 1.8709 1.3549 1.7087 1.8266 2.7682 2.9503 1.9477 1.7144 1.0640 3.0547 2.4781 2.0068 1.4042 1.2221 4.9950 1.9882 1.1172 1.1111 1.1048 1.0874 2.2016 5.8605 8.2709 7.4591 6.8633 1.0420 1.0378 1.0967 1.0892 1.0992 1.1020 1.0856 1.0893 1.0947 1.1008
irintensity: 1.8954 3.6773 1.9591 1.6179 1.9400 0.5222 6.7968 5.4608 0.6048 4.5336 4.8480 0.3034 4.9573 1.5507 11.9991 22.0515 3.8611 16.3631 0.5669 7.6882 0.6286 73.4896 0.8068 18.1331 14.0049 7.6821 0.6782 11.5169 2.3759 6.8121 9.7224 3.8185 5.9037 1.7508 93.6721 117.4614 81.7876 66.7504 40.8988 9.5493 4.6539 16.2530 24.0453 6.8610 18.8593 24.4368 72.5460 158.4755 28.3737 25.1755 6.6049 3.1866 9.9840 9.6597 12.2759 12.8017 0.1409 3.6003 16.7927 21.1817
temp: 298.150 k
press: 1.00000 atm
elementType: 8 8 6 6 6 6 6 6 6 6 6 6 1 1 1 1 1 1 1 1 1 1
symmnumber: 1
zpe: 448833.1 jmol-1
zpe.correction: 0.170951 hartree
zpe.thermalcorrener: 0.182701 hartree
zpe.thermalcorrenthalpy: 0.183645 hartree
zpe.thermalcorrgfe: 0.132668 hartree
zpe.sumelectzpe: -536.640078 hartree
zpe.sumelectthermal: -536.628329 hartree
zpe.sumelectthermalent: -536.627385 hartree
zpe.sumelectthermalfe: -536.678362 hartree
dipole: 4.8795 1.1595 2.9065
dipole: 5.7967
quadrupole: -69.5049 -62.7897 -74.3740
quadrupole: -0.2200 -6.6057 -3.1181
quadrupole: -0.6154 6.0999 -5.4845 -0.2200 -6.6057 -3.1181
hfenergy: -536.8110296 hartree
pointgroup: C01 [X(C10H10O2)]
dipole: -1.7796002 -0.9090468 1.0989857 debye
dipolederiv: -0.5846237 -0.2326503 0.0461993 -0.2526485 -0.6092094 0.2166882 0.0405706 0.2003052 -0.7300088 -0.944674 0.1250065 0.0130437 -0.0776103 -0.7412474 0.0388504 0.0346924 0.0178888 -0.3008603 -0.1671775 -0.073062 -0.0042678 -0.2275697 0.0065337 0.0040722 -0.0207594 -0.045883 -0.0799728 -0.3956565 0.3323263 -0.0299213 0.3603055 -0.371293 0.0557947 -0.111706 0.0371582 -0.0177274 -0.2612488 0.0064432 -0.0129052 -0.0122088 0.0974137 -0.0293393 0.031755 -0.0543524 -0.1208839 0.0197418 -0.1760526 0.014627 0.0289956 0.0755202 -0.024337 -0.0217164 -0.0272877 -0.1172073 0.9283334 0.4013023 0.1591258 0.4855889 0.7503901 -0.1873567 0.1823108 -0.0567979 0.9348151 1.1976417 -0.2482647 -0.0176702 -0.3039606 1.2542069 -0.167146 -0.0065613 -0.129347 0.1445525 0.1234487 -0.0554229 0.0230377 -0.0244895 0.1134694 -0.0290162 0.0123641 -0.0315705 -0.108438 0.1043422 0.1215187 -0.0089953 0.1030105 -0.2145516 0.0010432 -0.0121682 0.0127323 -0.1577412 -0.1975165 -0.0837014 -0.2207682 -0.1021753 -0.0183884 -0.0923418 -0.2133395 -0.0825388 -0.3291503 -0.0242173 -0.1384722 0.011742 0.0011492 -0.5401506 0.079513 -0.0000419 0.0588878 0.0372896 0.0898082 -0.0450928 0.0063394 -0.0058698 -0.0486989 0.0190558 -0.0158878 0.0225956 0.1416256 0.1017797 -0.026851 0.0029573 -0.0405578 -0.0853749 0.0237391 0.0143513 0.0171646 0.1394935 -0.0390604 0.0877523 -0.020646 0.0987472 0.0193858 0.0217174 -0.014659 0.0221527 0.1513822 -0.0939202 -0.0563147 0.0007469 -0.0715631 0.0637854 0.0084829 0.0032314 0.0125892 0.1587579 0.0827322 -0.055453 0.0215208 -0.0159694 -0.0285681 0.1351553 0.0568526 0.0827007 0.0407911 0.0897134 0.0803081 0.0246757 0.0374143 -0.0513758 -0.0813064 0.0027024 -0.0634313 0.0473168 -0.0758977 -0.0263689 -0.0013085 -0.0017059 0.1229663 0.0240213 0.0357858 0.0032826 0.0777448 0.0471225 -0.0489748 -0.0976643 -0.0277413 0.0685962 -0.0137576 -0.0855672 -0.0417551 -0.0043431 0.0443193 -0.010859 0.1079268 0.0002761 0.0788316 -0.0169058 0.0937579 0.0274566 -0.0256108 -0.0449905 0.1228827 -0.0177955 0.0485826 0.0577589 0.0133734 -0.0059677 0.0180492 0.1181748 unknown
polarizability: 139.8104661|0.761674|129.8461419|3.2505195|-9.7841289|66.5775083 unknown
InChI: InChI=1S/C10H10O2/c1-7(11)9-5-3-4-6-10(9)8(2)12/h3-6H,1-2H3
charge 0 multiplicity 1
22 atoms
O  1.666764 2.049394 -1.03544
O  2.026478 -1.129392 0.014405
C  -0.091939 0.75866 -0.017105
C  -0.319896 -0.644389 0.138008
C  -1.200242 1.622379 -0.187434
C  -1.653311 -1.135943 0.160064
C  1.286072 1.408574 -0.017717
C  0.852627 -1.575766 0.193351
C  -2.521036 1.121395 -0.162207
C  -2.7500 -0.262029 0.020628
C  2.048984 1.4692 1.299977
C  0.624973 -3.060858 0.447122
H  -1.018971 2.691017 -0.343999
H  -1.834185 -2.210207 0.267813
H  -3.36596 1.806879 -0.289529
H  -3.772239 -0.65425 0.037675
H  1.846854 0.604382 1.949773
H  1.738601 2.388369 1.837342
H  3.129462 1.537324 1.09836
H  0.055414 -3.516801 -0.384471
H  0.05111 -3.2314 1.376183
H  1.600837 -3.563436 0.522399
