program: Gaussian 09
title: 000035454
version: EM64L-G09RevD.01
frameworkgroup: C1[X(C12H4Cl4O2)]
method: RPBEPBE
basis: SDD
operation: Freq
keyword: #p
keyword: freq=noraman
keyword: PBEPBE/SDD
title: #p freq=noraman PBEPBE/SDD
converged: NO NO NO NO
title: Mulliken charges:
elementType: Cl Cl Cl Cl O O C C C C C C C C C C C C H H H H
charge: 0.056627 0.056631 0.056904 0.056874 -0.257804 -0.257798 0.458047 0.458050 0.249153 0.249166 -0.372928 -0.372934 -0.119095 -0.118994 -0.357177 -0.357177 -0.220642 -0.220642 0.266899 0.266899 0.239970 0.239970
chargesum: 0.00000
title: Mulliken charges with hydrogens summed into heavy atoms:
elementType: Cl Cl Cl Cl O O C C C C C C C C C C C C
charge: 0.056627 0.056631 0.056904 0.056874 -0.257804 -0.257798 0.458047 0.458050 0.249153 0.249166 -0.372928 -0.372934 -0.119095 -0.118994 -0.090278 -0.090278 0.019329 0.019329
polarizability: 2.82922254e+02 -3.44787099e-04 2.04308878e+02 -1.06902901e-03 3.65896627e-03 6.14045891e+01
1716.lowfreq: -7.2760 0.0002 0.0015 0.0024 4.0440 8.3754 28.8757 68.1735 71.7581
frequency: 28.8482 68.1683 71.7568 88.9009 126.8367 167.1547 185.5230 197.1461 201.6879 207.5142 269.6346 288.2909 292.0045 322.8433 324.0693 342.6143 345.8522 444.8916 517.2628 520.3513 523.4754 544.3329 562.0194 585.8134 595.8008 639.2443 682.1300 694.7425 753.2454 756.8715 761.2425 797.9805 849.1777 855.3074 918.2958 936.8290 937.4084 975.9911 1023.7629 1082.2690 1128.8265 1156.5332 1166.2616 1215.3819 1268.1020 1270.1699 1339.4718 1356.9695 1378.1144 1407.0730 1445.0094 1476.9085 1547.0019 1559.8441 1606.4711 1623.7851 3146.4336 3157.8086 3168.1659 3180.4471
redmass: 9.4539 9.1543 22.8834 9.6149 9.7257 13.2233 20.7452 30.6218 8.2783 34.8155 5.5352 14.1605 7.8351 12.2791 25.7904 21.1933 12.4477 3.1715 11.9754 13.3461 4.5508 8.4515 9.4462 11.3704 12.0955 11.7999 4.3299 7.9324 11.6593 10.0102 1.2246 10.0558 8.0459 1.3416 11.9927 11.6703 1.3646 1.3026 2.0077 2.9583 10.3333 2.0473 1.0842 4.2769 6.6183 1.5161 11.6318 9.2874 9.1921 10.9839 2.5023 3.0089 11.2347 9.8899 7.9609 8.2273 1.0860 1.0903 1.0951 1.1009
irintensity: 0.9325 0.0000 0.2053 0.0000 0.6759 0.0499 0.0098 0.0995 0.0000 0.0057 0.2352 1.5926 0.0959 0.0000 1.0591 0.0058 2.2658 5.3156 1.1100 2.1160 0.0000 0.3805 3.9043 0.0000 2.6899 25.9612 0.0000 0.7392 0.0000 36.5494 111.1290 72.4945 22.7601 0.0000 94.8631 1.8934 6.0437 0.0000 17.4550 16.4038 12.6979 0.0098 8.0872 136.0398 73.1135 3.1684 160.8372 108.0982 166.2016 446.5521 14.8822 285.4866 14.0061 0.0684 13.3646 0.7106 1.7612 10.2045 3.4334 10.6549
temp: 298.150 k
press: 1.00000 atm
elementType: 17 17 17 17 8 8 6 6 6 6 6 6 6 6 6 6 6 6 1 1 1 1
symmnumber: 1
zpe: 329487.9 jmol-1
zpe.correction: 0.125495 hartree
zpe.thermalcorrener: 0.140816 hartree
zpe.thermalcorrenthalpy: 0.141761 hartree
zpe.thermalcorrgfe: 0.081348 hartree
zpe.sumelectzpe: -2449.079615 hartree
zpe.sumelectthermal: -2449.064294 hartree
zpe.sumelectthermalent: -2449.063350 hartree
zpe.sumelectthermalfe: -2449.123762 hartree
dipole: -3.7914 0.0000 0.0003
dipole: 3.7914
quadrupole: -112.8685 -129.5181 -132.0510
quadrupole: -0.0005 -0.0013 0.0002
quadrupole: 11.9441 -4.7056 -7.2385 -0.0005 -0.0013 0.0002
hfenergy: -2449.2051105 hartree
pointgroup: C01 [X(C12H4Cl4O2)]
dipole: 1.4916629 -0.0000133 0.0001027 debye
dipolederiv: 0.0002872 -0.0273921 0.0000004 0.0322462 -0.6293095 0.0000086 -0.0000038 0.0000033 0.0157883 0.0002908 0.0273652 0.0000006 -0.0322772 -0.6292956 -0.0000014 0.000007 0.0000115 0.0157922 -0.548214 0.2850451 -0.0000071 0.323338 -0.1667154 0.0000045 0.0000137 -0.0000027 0.0133562 -0.5482438 -0.285023 0.0000425 -0.3233131 -0.1667038 0.0000261 0.0000358 0.0000241 0.0133337 -2.0723757 -0.0371484 -0.0000207 -0.0709738 -0.309699 0.0000223 -0.0000114 0.000037 -0.1306318 -2.072438 0.0372353 -0.000033 0.0710808 -0.3097131 -0.0000119 -0.0000103 -0.0000472 -0.1306293 1.2331386 0.1469964 -0.0000259 0.9911591 -0.0695646 0.0000011 -0.0000627 -0.0000057 0.1206824 1.233155 -0.1470715 -0.0000332 -0.9912152 -0.0694946 0.0000019 -0.0000396 0.0000188 0.1206945 1.2360273 -0.1354594 0.0000519 -0.8842096 0.1040432 -0.0000283 0.0000652 -0.000017 0.0681323 1.2360861 0.135407 0.000078 0.8841653 0.1040069 0.0000281 0.0000805 0.000026 0.0681321 -0.2720659 0.046833 -0.0000079 0.0718503 0.9478365 -0.0000201 0.0000205 -0.0000114 -0.0886096 -0.2721 -0.0467496 0.0000035 -0.0718359 0.9478238 0.0000152 -0.0000145 -0.0000081 -0.0886237 0.6063072 -0.4703991 0.0000278 -0.6017174 0.0291544 0.000004 -0.0000329 0.000011 -0.0309827 0.6063689 0.4703455 -0.0000762 0.6016987 0.0291299 -0.0000473 -0.0000358 -0.0000337 -0.0309583 -0.2603028 0.0303602 0.0000076 -0.0118416 0.0607162 -0.0000114 -0.0000007 -0.0000053 -0.1488334 -0.2602943 -0.0303406 0.000002 0.0118496 0.0607145 0.0000005 -0.0000129 -0.0000067 -0.1488315 0.0361374 0.0355472 0.0000137 0.0508356 0.0063998 0.0000026 0.0000161 -0.0000006 -0.1628845 0.0361289 -0.0355512 0.0000212 -0.0508391 0.0063974 -0.0000132 0.0000411 -0.0000124 -0.1628864 0.1095461 0.0320647 -0.0000074 0.0094303 -0.0184435 0.0000056 -0.0000023 0.0000047 0.176799 0.1095456 -0.0320693 -0.0000058 -0.009436 -0.0184415 0.0000051 -0.0000092 0.0000042 0.1767991 -0.0684956 -0.078077 -0.0000129 -0.0864516 0.045583 -0.000003 -0.0000167 -0.0000025 0.1671807 -0.0684889 0.0780818 -0.0000193 0.0864565 0.0455752 0.000011 -0.0000271 0.0000129 0.1671809 unknown
polarizability: 282.9222544|-0.0020315|204.3088779|0.001069|-0.003659|61.4045891 unknown
InChI: InChI=1S/C12H4Cl4O2/c13-7-8(14)10(16)12-11(9(7)15)17-5-3-1-2-4-6(5)18-12/h1-4H
charge 0 multiplicity 1
22 atoms
Cl -1.538243 3.208196 -0.000069
Cl -1.538384 -3.208119 0.000011
Cl -4.364239 1.615694 -0.000026
Cl -4.364315 -1.615491 0.000235
O  0.826723 1.451866 -0.000174
O  0.826662 -1.451884 -0.000154
C  -0.367792 0.708934 -0.000094
C  -0.367813 -0.708917 -0.000073
C  2.037919 0.707797 -0.000058
C  2.037892 -0.707873 -0.000024
C  -1.586298 1.41518 -0.000063
C  -1.58636 -1.415102 0.000002
C  -2.81444 0.708177 -0.00002
C  -2.814447 -0.708021 0.000078
C  3.24553 1.420379 0.000027
C  3.245469 -1.420503 0.000102
C  4.467832 0.707613 0.000135
C  4.467801 -0.707788 0.000171
H  3.215673 2.514299 0.0000
H  3.21557 -2.514422 0.000135
H  5.412956 1.25945 0.000191
H  5.412901 -1.259665 0.000269
