program: Gaussian 09
title: 000035447
version: EM64L-G09RevD.01
frameworkgroup: C1[X(C12H15NO2)]
method: RPBEPBE
basis: SDD
operation: Freq
keyword: #p
keyword: freq=noraman
keyword: PBEPBE/SDD
title: #p freq=noraman PBEPBE/SDD
converged: YES YES NO NO
title: Mulliken charges:
elementType: O O N C C C C C C C C C C C C H H H H H H H H H H H H H H H
charge: -0.450377 -0.284979 -0.413235 0.484121 0.435603 -0.360086 -0.370567 -0.387707 -0.388800 -0.395554 -0.242916 -0.314855 -0.389276 0.241408 -0.804963 0.222011 0.237788 0.221598 0.236096 0.231044 0.233367 0.266764 0.300244 0.220699 0.234744 0.205932 0.227903 0.227153 0.239270 0.337566
chargesum: 0.00000
title: Mulliken charges with hydrogens summed into heavy atoms:
elementType: O O N C C C C C C C C C C C C
charge: -0.112810 -0.284979 -0.112990 0.484121 0.435603 0.099713 -0.148968 -0.151611 -0.157755 -0.162187 0.023848 0.140587 -0.183343 0.241408 -0.110636
polarizability: 2.86660001e+02 -1.53858369e+00 1.33372579e+02 1.45785289e+01 1.14939510e+01 7.98540675e+01
1716.lowfreq: -17.2678 -5.9383 -4.9192 -0.0008 -0.0006 -0.0005 6.9242 24.6373 28.1262
frequency: 3.6978 24.3539 27.2907 53.1844 62.9578 79.3265 108.9572 160.3080 191.2695 201.4852 240.9749 253.9356 292.8211 330.3298 349.7006 366.2650 406.8386 469.6015 498.8772 511.1110 524.4845 541.4105 638.1659 682.1599 694.2890 731.7167 763.2289 824.2583 825.1476 843.3097 855.7769 868.4575 876.7379 952.9679 956.8535 975.7292 987.6891 998.6823 1010.2669 1011.0633 1046.2322 1072.6403 1083.8250 1123.5813 1171.2390 1193.0376 1194.0400 1219.7045 1229.1300 1265.5867 1294.9481 1319.4672 1324.4431 1328.5464 1351.4635 1369.7299 1375.3091 1396.6335 1416.0861 1424.9939 1467.9855 1469.4576 1472.7551 1474.2141 1509.8518 1571.9406 1580.1601 1621.4008 1653.1875 2975.3558 3000.0152 3008.5514 3056.9539 3078.1290 3086.9850 3091.4861 3095.6907 3104.9461 3118.6765 3119.7163 3140.4837 3146.8103 3558.7277 3562.0453
redmass: 1.0283 4.1270 5.1872 5.0152 3.9272 5.1166 3.0283 3.0295 3.2330 3.8373 4.1649 2.8831 1.4635 2.5397 3.2747 2.6856 2.7828 2.9970 2.3815 4.7552 1.7752 1.7043 6.8700 3.9637 4.4624 3.0194 3.9305 2.5044 1.8549 1.2963 3.4548 2.4625 1.8725 2.7390 1.3222 1.3824 1.4098 2.9881 1.2853 2.5864 1.5804 2.0300 3.2161 1.3522 1.2761 1.2347 1.6764 1.5586 3.1899 1.2290 1.8847 1.5789 1.3031 1.2113 1.3126 1.2918 3.4455 1.2208 3.2708 1.1725 1.0910 1.1101 1.0586 1.7543 2.7026 5.6943 6.7960 6.2239 5.6515 1.0389 1.0633 1.0598 1.0945 1.1020 1.0999 1.1039 1.0920 1.0880 1.0872 1.0874 1.0962 1.0971 1.0780 1.0660
irintensity: 0.5712 0.1221 0.5888 9.2327 0.6099 5.0009 4.2949 0.8911 7.2417 1.9179 18.8270 44.2317 146.9137 14.5516 2.8029 30.4335 0.1361 3.2226 39.0750 11.5529 2.3446 33.5407 0.3595 0.4697 8.2328 1.1553 3.9598 17.6707 62.4235 1.7829 22.7080 8.9298 10.6546 14.1446 0.7431 0.3985 0.8075 80.6185 51.0879 3.2046 24.9394 2.2312 24.3480 11.4426 26.3392 69.5252 97.4973 34.7246 1.0449 12.7179 14.8457 38.9082 1.9056 31.3485 7.2845 26.4775 16.1050 9.9738 5.7983 44.6457 11.5049 22.7738 15.3641 276.4748 68.5955 5.0217 220.6148 27.2348 115.2668 35.5209 30.8929 38.0735 22.5454 14.9459 16.9964 51.9127 0.8946 17.6871 4.0522 20.6684 40.3027 4.5330 23.1154 5.3941
temp: 298.150 k
press: 1.00000 atm
elementType: 8 8 7 6 6 6 6 6 6 6 6 6 6 6 6 1 1 1 1 1 1 1 1 1 1 1 1 1 1 1
symmnumber: 1
zpe: 642166.4 jmol-1
zpe.correction: 0.244588 hartree
zpe.thermalcorrener: 0.260475 hartree
zpe.thermalcorrenthalpy: 0.261419 hartree
zpe.thermalcorrgfe: 0.196371 hartree
zpe.sumelectzpe: -670.358050 hartree
zpe.sumelectthermal: -670.342164 hartree
zpe.sumelectthermalent: -670.341220 hartree
zpe.sumelectthermalfe: -670.406268 hartree
dipole: 3.7698 -2.5441 -1.3784
dipole: 4.7522
quadrupole: -85.3620 -87.7579 -92.4003
quadrupole: 0.0196 9.4652 4.9775
quadrupole: 3.1447 0.7488 -3.8936 0.0196 9.4652 4.9775
hfenergy: -670.6026384 hartree
pointgroup: C01 [X(C12H15N1O2)]
dipole: 1.4797671 0.8847486 0.7233008 debye
polarizability: 286.8147883|3.9402373|127.4940336|-12.9304601|20.3277669|85.5778252 unknown
InChI: InChI=1S/C12H15NO2/c1-10-2-4-11(5-3-10)6-7-12(15)13-8-9-14/h2-7,13-14H,8-9H2,1H3
charge 0 multiplicity 1
30 atoms
O  -5.407428 1.569715 -1.02578
O  -2.52012 -1.589772 -0.251657
N  -3.255752 0.3937 0.71498
C  1.619866 -0.241194 -0.076238
C  4.428086 0.390019 -0.085894
C  -4.665512 -0.035699 0.735746
C  2.096204 1.002924 0.431266
C  2.581948 -1.157313 -0.589083
C  3.468925 1.308623 0.423499
C  3.956382 -0.847217 -0.59508
C  0.201713 -0.61915 -0.099204
C  -5.357861 0.153784 -0.629617
C  -0.869224 0.11097 0.336203
C  -2.248005 -0.44315 0.234332
C  5.910034 0.715887 -0.061658
H  -5.195329 0.557345 1.501869
H  -4.705169 -1.105864 1.012537
H  1.388168 1.737675 0.831005
H  2.239068 -2.11926 -0.989554
H  3.810404 2.273943 0.816723
H  4.673487 -1.571363 -0.999777
H  -0.040638 -1.608853 -0.515021
H  -3.004273 1.283605 1.146977
H  -6.411869 -0.161852 -0.558973
H  -4.846072 -0.463627 -1.393113
H  -0.745796 1.112587 0.770468
H  6.452048 0.200831 -0.873953
H  6.088925 1.800745 -0.163725
H  6.370149 0.39645 0.893989
H  -4.484259 1.861511 -1.235468
