program: Gaussian 09
title: 000003104
version: EM64L-G09RevD.01
frameworkgroup: C1[X(C11H18N5O12P3)]
method: RPBEPBE
basis: SDD
operation: Freq
keyword: #p
keyword: freq=noraman
keyword: PBEPBE/SDD
title: #p freq=noraman PBEPBE/SDD
converged: YES YES NO NO
title: Mulliken charges:
elementType: P P P O O O O O O O O O O O O N N N N N C C C C C C C C C C C H H H H H H H H H H H H H H H H H H
charge: 1.313266 1.292652 1.434481 -0.226572 -0.548712 -0.447525 -0.506374 -0.684132 -0.568387 -0.743957 -0.662940 -0.613996 -0.716601 -0.671952 -0.631287 -0.168519 -0.078197 -0.092682 -0.055560 -0.607695 -0.098713 -0.200399 -0.022308 -0.128146 -0.295083 0.187290 -0.206918 -0.109804 -1.014613 0.168493 -0.359286 0.268145 0.314756 0.307418 0.243377 0.244232 0.237447 0.403548 0.362056 0.271008 0.356620 0.339638 0.402214 0.294551 0.337744 0.345351 0.435845 0.465684 0.434540
chargesum: 0.00000
title: Mulliken charges with hydrogens summed into heavy atoms:
elementType: P P P O O O O O O O O O O O O N N N N N C C C C C C C C C C C
charge: 1.313266 1.292652 1.434481 -0.226572 -0.145163 -0.085468 -0.506374 -0.281917 -0.568387 -0.743957 -0.227095 -0.613996 -0.250917 -0.237412 -0.631287 -0.168519 -0.078197 -0.092682 -0.055560 0.075400 0.169432 0.114357 0.285110 0.115231 0.186595 0.187290 0.064091 -0.109804 -0.318355 0.168493 -0.064735
polarizability: 2.86675219e+02 -1.69543288e+00 2.63527236e+02 -1.89853382e+01 -1.73216980e+01 2.33516548e+02
1716.lowfreq: -7.2181 -4.0216 -1.5051 -0.0016 -0.0009 0.0003 20.1118 23.1096 34.1954
frequency: 19.7338 23.0950 34.1795 38.8707 47.0199 56.4851 64.4691 70.2803 89.3775 94.8430 102.3101 104.9665 118.1368 128.3843 146.7121 157.0405 170.5072 175.1796 192.4266 195.2555 206.0673 209.8404 224.6187 228.2024 232.2106 235.4258 269.5081 278.4333 292.5670 301.8888 304.6822 319.3921 327.1874 329.7511 337.2406 345.0878 355.3735 364.7327 370.6786 380.3678 399.7300 414.4493 438.2947 445.6348 488.5284 511.0685 521.1560 528.0080 537.1723 550.6012 552.7709 566.9635 570.9576 593.4317 599.8366 616.6199 638.7512 644.9640 652.1358 660.4651 676.7329 677.8687 705.6918 709.5349 720.8506 740.0989 781.8501 785.1914 789.9462 804.6506 820.8959 824.3394 853.1929 860.3000 897.7976 932.0851 950.0688 953.2593 959.9984 981.9461 990.1937 1001.5091 1007.0638 1015.1129 1022.5646 1028.9272 1033.6152 1049.4796 1074.6429 1075.4894 1132.3249 1145.2744 1153.0910 1156.2561 1174.4769 1178.8981 1186.1692 1197.8710 1219.6608 1222.0347 1231.0533 1241.8953 1270.2396 1276.1003 1290.6545 1298.6359 1300.3969 1312.6274 1326.2762 1345.1869 1359.4104 1374.0642 1378.6255 1381.8680 1386.9638 1391.4839 1409.8074 1432.2801 1441.2023 1463.8909 1548.3679 1578.9979 1634.1501 2595.0462 3000.6093 3009.5702 3028.1704 3034.6421 3053.9728 3058.0717 3076.8588 3136.1979 3180.3214 3227.1545 3248.1034 3310.4824 3537.5411 3581.7387 3590.0310 3611.2432 3692.4746
redmass: 9.2845 8.8151 9.0985 7.4102 6.5973 9.2235 7.2843 7.9839 7.1120 8.6118 9.2177 8.9182 7.1657 6.6239 6.4286 6.0461 9.2715 7.8238 5.7714 5.9628 4.4391 6.7276 4.7178 6.0626 5.4881 3.4832 4.3691 5.6614 2.7245 7.4484 4.8380 3.6725 6.0525 1.2653 4.7093 2.2428 4.7879 4.4636 4.3850 8.0356 5.4077 1.8238 4.3156 7.5938 3.5758 8.7297 4.8367 1.2273 5.0170 2.0568 1.4832 6.4655 4.8995 5.9790 1.2638 3.1726 1.9909 4.5764 3.2844 6.3782 8.4259 7.3704 6.9185 9.5753 7.1742 8.9622 6.1252 5.1850 2.9507 2.9724 2.2955 2.0255 7.8237 8.7367 1.1736 5.6199 1.6165 6.4020 2.1948 4.1084 1.4053 5.0544 5.2690 3.6370 4.2606 3.3781 3.4465 2.8794 3.4505 3.3731 1.9740 1.3086 4.0694 1.2510 1.6237 1.4622 1.2127 1.2478 2.1542 1.1905 1.2555 1.7026 1.9282 1.4176 2.2291 2.0941 1.2028 4.1652 1.5268 1.5121 1.3115 1.1250 1.3764 1.3312 1.7188 3.0659 1.6359 2.7640 1.0795 3.7929 7.6624 1.8890 2.6742 1.0802 1.0565 1.0851 1.0861 1.0868 1.0576 1.0866 1.1072 1.1041 1.0939 1.0984 1.0666 1.0660 1.0444 1.0667 1.0661 1.0659 1.1056
irintensity: 0.7251 0.3356 0.5926 0.9280 0.5407 2.1006 0.6280 0.2539 1.6919 6.4966 4.0908 3.8953 3.3390 3.8411 14.0309 2.6160 4.2980 1.1779 2.6076 5.1894 4.9223 0.9863 5.4560 5.9251 17.0199 1.3869 5.1291 3.8836 12.5894 11.7414 18.8365 6.3237 27.6390 77.3382 101.9093 136.2693 65.4072 19.6085 26.3919 92.9806 19.8011 108.1640 10.6401 18.1559 2.8535 7.0832 20.5416 242.4163 4.2454 4.6679 16.0338 26.8412 10.3354 5.2610 47.4989 88.0247 57.8401 17.7762 364.8828 5.2310 132.2335 12.1612 0.6560 239.6145 124.5457 62.6800 105.9085 133.8990 23.0025 25.9137 23.1211 67.5933 42.4399 111.7750 122.3808 202.7246 5.5875 209.0477 12.8937 68.3382 25.2393 120.6357 6.7841 342.8042 49.1267 26.7892 60.6674 89.9662 141.7970 103.1506 12.6186 157.9092 45.7235 72.4590 57.7269 11.7480 80.3036 17.2526 69.4652 8.5436 29.7878 24.3963 36.8200 16.0096 12.2121 26.8005 7.0911 51.3067 27.9332 61.6864 111.0199 16.2156 25.8028 34.8715 15.3106 5.0652 15.2405 77.0240 19.5659 14.1753 60.4777 30.8597 634.3687 2216.2908 19.7052 19.5938 9.8190 3.1082 8.0176 17.7512 13.7902 6.8484 0.7415 0.0464 137.7424 209.0009 145.0163 20.1473 80.4629 61.7346 50.6550
temp: 298.150 k
press: 1.00000 atm
elementType: 15 15 15 8 8 8 8 8 8 8 8 8 8 8 8 7 7 7 7 7 6 6 6 6 6 6 6 6 6 6 6 1 1 1 1 1 1 1 1 1 1 1 1 1 1 1 1 1 1
symmnumber: 1
zpe: 879323.6 jmol-1
zpe.correction: 0.334917 hartree
zpe.thermalcorrener: 0.367309 hartree
zpe.thermalcorrenthalpy: 0.368253 hartree
zpe.thermalcorrgfe: 0.270834 hartree
zpe.sumelectzpe: -2627.712526 hartree
zpe.sumelectthermal: -2627.680133 hartree
zpe.sumelectthermalent: -2627.679189 hartree
zpe.sumelectthermalfe: -2627.776609 hartree
dipole: 4.9261 -6.6525 5.5882
dipole: 9.9875
quadrupole: -181.2576 -206.4080 -205.0547
quadrupole: 15.8647 -0.3568 -17.6648
quadrupole: 16.3158 -8.8346 -7.4813 15.8647 -0.3568 -17.6648
hfenergy: -2628.0474423 hartree
pointgroup: C01 [X(C11H18N5O12P3)]
dipole: 1.9146 -3.1547716 1.3497515 debye
polarizability: 289.2873287|5.7810509|271.488692|-12.2020608|-3.5012566|222.9429827 unknown
InChI: InChI=1S/C11H18N5O12P3/c12-9-6-10(14-2-13-9)16(3-15-6)11-8(18)7(17)5(27-11)1-26-29(19,20)4-30(21,22)28-31(23,24)25/h2-3,5,7-8,11,17-19,21,23-24H,1,4,12H2
charge 0 multiplicity 1
49 atoms
P  -3.025091 -1.509881 -2.453167
P  -3.895149 0.931979 -0.611003
P  -2.422182 1.714271 1.809517
O  1.08608 -2.211456 -0.392479
O  -0.600961 -1.368617 2.769388
O  2.194577 -2.844987 2.916293
O  -1.570668 -1.390769 -1.527986
O  -3.611326 -3.130128 -2.171205
O  -2.830537 -1.091225 -3.966083
O  -2.918109 0.357513 0.741024
O  -5.380351 1.368023 0.119917
O  -3.096586 2.087846 -1.374812
O  -1.501775 0.976138 2.955511
O  -1.319329 2.570825 0.827263
O  -3.742966 2.49104 2.24367
N  3.17699 -1.044937 0.05223
N  4.946816 -0.03436 -1.013299
N  1.853044 0.979908 0.637208
N  2.935039 3.046602 -0.125829
N  5.00772 3.073641 -1.255865
C  0.198135 -2.096053 1.772664
C  1.711206 -1.874041 1.936264
C  -0.082015 -1.620458 0.33268
C  2.265879 -2.102902 0.491866
C  -1.364935 -2.15575 -0.27377
C  2.929056 0.337698 0.099654
C  4.394769 -1.199789 -0.645145
C  4.033787 0.93925 -0.553785
C  -4.368028 -0.633461 -1.471942
C  4.008266 2.363119 -0.652125
C  1.932576 2.338679 0.475732
H  -0.013739 -3.179237 1.870877
H  1.891129 -0.832327 2.260227
H  -0.039698 -0.517147 0.268227
H  2.804353 -3.06415 0.425534
H  -2.199337 -1.974526 0.429437
H  -1.276298 -3.231993 -0.506323
H  -0.469358 -1.764568 3.664579
H  3.077545 -2.566464 3.265766
H  4.815583 -2.182933 -0.848433
H  -5.189983 -0.405643 -2.171152
H  -4.738202 -1.326306 -0.700777
H  -3.385695 -3.771661 -2.892985
H  1.083792 2.911662 0.858399
H  4.923085 4.086676 -1.314964
H  5.800548 2.588546 -1.670682
H  -5.231084 1.981066 0.907205
H  -1.071586 0.03633 2.782122
H  -1.709787 2.749252 -0.08924
