program: Gaussian 09
title: 000035484
version: EM64L-G09RevD.01
frameworkgroup: C1[X(C12H10Cl3N5O)]
method: RPBEPBE
basis: SDD
operation: Freq
keyword: #p
keyword: freq=noraman
keyword: PBEPBE/SDD
title: #p freq=noraman PBEPBE/SDD
converged: NO YES NO NO
title: Mulliken charges:
elementType: Cl Cl Cl O N N N N N C C C C C C C C C C C C H H H H H H H H H H
charge: 0.101751 0.156055 0.101557 -0.199323 -0.499040 -0.438847 0.044329 -0.094106 0.017183 0.489380 0.045469 0.292670 0.080885 0.270734 -0.444034 -0.328216 -0.196333 -0.214673 -0.774251 -0.744218 -0.253135 0.295580 0.328177 0.215888 0.305029 0.228745 0.230287 0.257329 0.248957 0.244189 0.231982
chargesum: 0.00000
title: Mulliken charges with hydrogens summed into heavy atoms:
elementType: Cl Cl Cl O N N N N N C C C C C C C C C C C C
charge: 0.101751 0.156055 0.101557 -0.199323 -0.203459 -0.110670 0.044329 -0.094106 0.017183 0.489380 0.045469 0.292670 0.080885 0.270734 -0.228146 -0.023187 0.032412 0.015614 -0.774251 0.006257 -0.021153
polarizability: 3.36625509e+02 2.57749684e+01 2.08992285e+02 -4.34110343e-01 -6.10582827e-01 1.08905520e+02
1716.lowfreq: -35.8100 -27.2266 -11.5162 -4.1911 -1.3170 -0.0021 -0.0012 0.0005 3.8163
frequency: -35.8081 -27.1869 -10.1421 30.5290 40.2391 55.8000 82.6550 89.9240 115.7059 151.3043 167.3262 191.4727 204.8903 218.5575 220.4852 238.3488 241.9472 291.2246 305.1855 320.5747 342.5207 380.4346 406.3327 463.9749 482.2079 529.4173 543.5550 560.0171 591.6360 613.9387 640.7456 659.0734 685.0801 695.9052 709.8732 728.7284 747.8272 763.7578 768.2895 784.6206 830.6574 840.8812 845.8980 903.3690 916.6741 934.0161 972.7664 977.0986 984.8408 1000.5760 1009.9052 1027.9187 1051.6406 1079.1732 1094.4113 1131.0179 1173.9611 1191.0476 1194.4218 1257.2934 1282.8578 1320.5851 1335.5125 1381.2948 1391.0757 1396.7823 1429.6894 1447.7076 1453.9616 1480.5643 1482.8272 1497.6407 1514.2015 1531.6099 1604.2628 1616.2792 1680.1728 2998.2619 3089.6976 3106.7740 3135.5585 3138.9662 3147.6888 3168.0933 3199.9439 3504.7801 3524.6473
redmass: 1.0139 4.8524 23.5247 6.4051 9.0889 5.1813 11.2566 5.9315 8.3879 11.4619 5.2702 4.7230 7.2842 12.5557 12.4062 13.6902 3.3672 16.5066 5.2315 12.3823 6.7229 24.8770 2.9166 5.1555 1.7470 8.3918 1.9163 5.8444 4.8907 6.4392 3.4771 9.1264 1.9261 2.0233 3.9718 7.5708 10.6639 4.5658 1.9387 7.2102 9.1033 1.2689 5.9413 13.5129 1.4260 8.6225 1.3550 2.5535 5.9631 1.3096 5.2101 2.1917 1.6730 2.6870 1.7104 2.9212 1.0508 1.1124 7.8132 2.5328 4.5563 1.4682 4.6426 5.1088 3.8654 1.3910 2.3299 1.2278 1.2040 2.7664 3.5117 3.0793 2.5332 2.3499 4.8786 6.0391 5.5787 1.0414 1.0908 1.0891 1.0867 1.1021 1.0932 1.0999 1.0949 1.0761 1.0759
irintensity: 0.3408 2.4877 0.0956 0.5835 0.0217 4.0403 0.3206 0.0321 1.1338 1.0539 0.0126 1.8504 3.6106 0.9409 1.8085 2.7836 1.1686 0.0087 1.2738 3.1578 2.0077 0.5006 0.0367 14.7328 25.7205 22.8957 0.9650 12.1448 30.6125 1.3277 125.1814 35.1863 0.8962 51.1810 18.2693 27.6979 109.1678 48.8377 202.1537 19.6231 1.2869 0.2708 4.3803 29.6486 14.4873 41.9574 0.1352 1.7556 0.0980 2.3900 38.4224 1.4444 13.9332 24.2556 15.5820 357.4160 0.5685 0.9069 110.2874 116.3075 0.8042 82.2037 184.9373 141.6442 155.4656 102.6220 204.7501 29.7070 205.3972 1111.0682 84.4726 561.6722 141.1384 68.9190 37.2660 29.3984 210.2000 1.5982 9.1436 16.7893 0.1371 5.0841 26.8028 26.4938 7.9798 13.5049 31.6671
temp: 298.150 k
press: 1.00000 atm
elementType: 17 17 17 8 7 7 7 7 7 6 6 6 6 6 6 6 6 6 6 6 6 1 1 1 1 1 1 1 1 1 1
symmnumber: 1
zpe: 552334.5 jmol-1
zpe.correction: 0.210373 hartree
zpe.thermalcorrener: 0.227988 hartree
zpe.thermalcorrenthalpy: 0.228932 hartree
zpe.thermalcorrgfe: 0.162994 hartree
zpe.sumelectzpe: -2190.939643 hartree
zpe.sumelectthermal: -2190.922028 hartree
zpe.sumelectthermalent: -2190.921084 hartree
zpe.sumelectthermalfe: -2190.987022 hartree
dipole: -4.1490 5.8532 -0.0695
dipole: 7.1750
quadrupole: -130.8567 -126.8784 -144.8743
quadrupole: 0.3751 -0.2702 -0.2802
quadrupole: 3.3464 7.3247 -10.6711 0.3751 -0.2702 -0.2802
hfenergy: -2191.1500156 hartree
pointgroup: C01 [X(C12H10Cl3N5O1)]
dipole: -1.3975552 -2.4524837 0.0246808 debye
polarizability: 340.4408174|-12.7633873|205.1786899|0.3735727|-0.43019|108.9038062 unknown
InChI: InChI=1S/C12H10Cl3N5O/c1-7-16-9(12(13,14)15)19-10(17-7)20-11(21)18-8-5-3-2-4-6-8/h2-6,18,20H,1H3
charge 0 multiplicity 1
31 atoms
Cl 4.870151 1.884096 -1.52543
Cl 2.598271 3.132536 0.016551
Cl 4.890227 1.863477 1.511155
O  -1.046293 1.030135 0.002403
N  -2.430496 -0.879987 -0.003598
N  -0.122144 -1.162297 -0.007221
N  1.766321 0.327858 -0.004807
N  1.989959 -2.099077 -0.013938
N  3.963181 -0.706153 -0.01189
C  -3.73229 -0.295011 -0.000612
C  1.246448 -0.939092 -0.008498
C  3.1196 0.365196 -0.00585
C  3.345434 -1.933157 -0.013331
C  -1.199131 -0.212022 -0.002249
C  -4.837408 -1.189171 -0.002704
C  -3.959324 1.1067 0.004051
C  -6.155094 -0.690794 -0.000194
C  -5.286434 1.587956 0.006491
C  3.799097 1.743401 -0.000931
C  4.211512 -3.159479 0.00121
C  -6.389061 0.704141 0.004413
H  -2.427528 -1.902511 -0.007186
H  -0.332805 -2.165433 -0.011121
H  -4.666344 -2.2741 -0.006315
H  -3.110494 1.792011 0.005664
H  -6.996859 -1.391728 -0.001863
H  -5.45477 2.670524 0.010036
H  5.203114 -2.929137 -0.41605
H  4.353974 -3.503518 1.043395
H  3.733044 -3.979465 -0.5569
H  -7.412458 1.093102 0.006318
