program: Gaussian 09
title: 000035442
version: EM64L-G09RevD.01
frameworkgroup: C1[X(C12H14ClNO2)]
method: RPBEPBE
basis: SDD
operation: Freq
keyword: #p
keyword: freq=noraman
keyword: PBEPBE/SDD
title: #p freq=noraman PBEPBE/SDD
converged: YES YES NO NO
title: Mulliken charges:
elementType: Cl O O N C C C C C C C C C C C C H H H H H H H H H H H H H H
charge: -0.050189 -0.447507 -0.306002 -0.156033 -0.385803 -0.321472 0.218052 -0.634659 -0.295574 0.497974 -0.290417 -0.368180 -0.380219 -0.218804 -0.223324 -0.109879 0.243029 0.237699 0.218721 0.201507 0.230776 0.218768 0.286861 0.217013 0.274074 0.232278 0.244625 0.256217 0.258313 0.352156
chargesum: 0.00000
title: Mulliken charges with hydrogens summed into heavy atoms:
elementType: Cl O O N C C C C C C C C C C C C
charge: -0.050189 -0.095351 -0.306002 -0.156033 0.094925 0.098756 0.218052 0.101747 -0.078562 0.497974 -0.016344 -0.135901 -0.135594 0.037412 0.034989 -0.109879
polarizability: 2.98364661e+02 7.87753285e+00 1.52449865e+02 6.92056443e+00 -1.06745677e+01 7.96213878e+01
1716.lowfreq: -0.0025 0.0006 0.0015 2.8663 4.8608 10.0972 25.6745 35.3878 42.2336
frequency: 25.3808 35.3476 42.2001 75.2965 82.9001 92.3002 119.4226 135.6522 174.1663 185.0704 199.5678 220.6798 258.6025 288.7311 317.2515 342.9942 354.5446 393.2505 406.7935 410.6933 448.6005 497.3132 519.5411 626.4293 627.5231 669.0356 677.0039 724.9644 796.8551 818.1528 825.5413 829.2334 877.7743 878.0405 954.7717 967.2217 972.2657 985.9459 997.7033 1001.3674 1014.9289 1063.0605 1073.5231 1110.4145 1117.8982 1121.5345 1173.3132 1188.4954 1211.3612 1217.7239 1243.7294 1273.1536 1290.9992 1300.0216 1317.3960 1341.0635 1371.6925 1391.2330 1403.3631 1413.2356 1419.6830 1477.6467 1481.2440 1482.5798 1491.4023 1498.4887 1552.2143 1572.9528 1597.7197 1646.9536 2949.8034 2968.5254 3001.4602 3026.6336 3044.2677 3084.5293 3103.6083 3116.7404 3138.3994 3141.3765 3149.9002 3171.2601 3174.9497 3580.8611
redmass: 3.8189 6.7794 6.0529 5.2283 6.2642 2.7768 1.8733 1.2456 3.9232 4.5895 5.2584 4.3271 1.1151 4.4124 4.2772 4.2070 4.2868 4.4789 5.9412 2.8968 3.6351 2.7248 4.5006 6.6380 6.7149 4.6901 4.7108 3.7241 5.7146 1.1411 1.2742 1.5713 3.8664 1.9380 1.3450 1.3732 3.2899 3.9393 4.0466 2.8757 1.2229 1.5434 2.8264 1.3913 1.5184 1.6872 1.3295 1.1248 1.2402 1.6116 3.6606 1.4876 1.5897 1.3658 1.3948 1.2925 4.0547 2.1194 3.1661 1.3387 1.4492 1.4707 1.6386 1.0810 1.0588 1.0957 6.9323 7.1315 6.0802 5.7023 1.0550 1.0359 1.1074 1.0602 1.1017 1.1051 1.0895 1.0972 1.0899 1.0891 1.0894 1.0956 1.0964 1.0668
irintensity: 0.2075 0.0991 0.2435 2.9691 5.9552 8.0160 3.8361 1.7577 0.6233 0.5383 1.0852 7.2402 158.1742 3.7479 15.0467 1.0357 14.4445 8.8077 17.8782 0.3781 6.1857 29.3623 6.5606 3.7467 8.0314 5.1606 6.9271 0.1643 15.4785 8.2497 0.9999 84.2792 19.0353 2.9683 1.9904 0.4249 88.0839 27.6199 36.8678 4.4377 42.2947 11.3804 89.3220 10.6880 47.5184 103.4416 50.3742 4.3441 32.1304 12.6220 21.8927 0.2270 10.8534 5.3531 11.1618 8.4720 3.0717 141.8220 8.4227 61.0779 70.6315 31.1564 104.5662 10.8266 21.3006 15.5959 193.3625 4.8167 29.4967 113.5407 51.6644 83.3178 57.8848 37.9560 37.2675 32.4818 0.2342 1.7493 4.6848 8.4818 18.0924 6.9673 2.0941 5.7655
temp: 298.150 k
press: 1.00000 atm
elementType: 17 8 8 7 6 6 6 6 6 6 6 6 6 6 6 6 1 1 1 1 1 1 1 1 1 1 1 1 1 1
symmnumber: 1
zpe: 618274.8 jmol-1
zpe.correction: 0.235488 hartree
zpe.thermalcorrener: 0.252191 hartree
zpe.thermalcorrenthalpy: 0.253136 hartree
zpe.thermalcorrgfe: 0.188765 hartree
zpe.sumelectzpe: -1129.727947 hartree
zpe.sumelectthermal: -1129.711244 hartree
zpe.sumelectthermalent: -1129.710300 hartree
zpe.sumelectthermalfe: -1129.774670 hartree
dipole: -2.0587 2.8114 1.0783
dipole: 3.6476
quadrupole: -98.0150 -103.6531 -102.3460
quadrupole: -12.2533 -3.2477 4.9485
quadrupole: 3.3230 -2.3151 -1.0080 -12.2533 -3.2477 4.9485
hfenergy: -1129.963435 hartree
pointgroup: C01 [X(C12H14Cl1N1O2)]
dipole: 0.8381393 1.0359004 -0.5328226 debye
polarizability: 297.7800581|-10.0244339|154.2507911|10.6291407|2.1482876|78.4050645 unknown
InChI: InChI=1S/C12H14ClNO2/c1-14(8-9-15)12(16)7-4-10-2-5-11(13)6-3-10/h2-7,15H,8-9H2,1H3
charge 0 multiplicity 1
30 atoms
Cl -5.998503 1.025424 -0.078032
O  3.540664 3.203678 -0.489668
O  2.238229 -2.425379 0.116051
N  3.387009 -0.417638 0.418219
C  3.448606 1.050239 0.554773
C  3.429215 1.772874 -0.805846
C  2.207382 -1.155101 0.251341
C  4.673362 -1.139362 0.422836
C  0.915714 -0.403139 0.239873
C  -1.617974 -0.535278 0.051031
C  -0.256916 -1.088242 0.083841
C  -1.908025 0.853792 0.196295
C  -2.711766 -1.429556 -0.133026
C  -3.231493 1.331458 0.157894
C  -4.044005 -0.969301 -0.173928
C  -4.284523 0.410232 -0.027872
H  4.387698 1.312902 1.073096
H  2.627419 1.432176 1.184477
H  2.483315 1.550816 -1.343393
H  4.278707 1.426057 -1.431419
H  5.171069 -1.044119 1.406824
H  5.351803 -0.742455 -0.356174
H  4.468878 -2.20189 0.22216
H  0.919525 0.684753 0.359567
H  -0.158657 -2.177743 -0.030055
H  -1.095432 1.573106 0.3439
H  -2.512938 -2.501734 -0.245137
H  -3.446257 2.397998 0.271315
H  -4.875002 -1.6659 -0.315344
H  3.563998 3.731631 -1.326097
