program: Gaussian 09
title: 000035487
version: EM64L-G09RevD.01
frameworkgroup: C1[X(C12H9Cl4N5O)]
method: RPBEPBE
basis: SDD
operation: Freq
keyword: #p
keyword: freq=noraman
keyword: PBEPBE/SDD
title: #p freq=noraman PBEPBE/SDD
converged: NO YES NO NO
title: Mulliken charges:
elementType: Cl Cl Cl Cl O N N N N N C C C C C C C C C C C C H H H H H H H H H
charge: 0.103452 0.156498 0.103939 -0.054290 -0.199037 -0.500677 -0.438611 0.044553 -0.090187 0.017063 0.505002 0.047180 0.290958 0.082225 0.272527 -0.435760 -0.311039 -0.182902 -0.198020 -0.775215 -0.122190 -0.745081 0.298287 0.329080 0.223678 0.310835 0.257123 0.257958 0.244611 0.248077 0.259963
chargesum: 0.00000
title: Mulliken charges with hydrogens summed into heavy atoms:
elementType: Cl Cl Cl Cl O N N N N N C C C C C C C C C C C C
charge: 0.103452 0.156498 0.103939 -0.054290 -0.199037 -0.202391 -0.109531 0.044553 -0.090187 0.017063 0.505002 0.047180 0.290958 0.082225 0.272527 -0.212082 -0.000204 0.074221 0.059939 -0.775215 -0.122190 0.007569
polarizability: 3.74568138e+02 2.80948973e+01 2.12341978e+02 4.24230512e-01 3.04184795e-01 1.11258673e+02
1716.lowfreq: -52.6153 -27.0366 -13.3884 -6.5232 -3.1282 -1.6523 0.0013 0.0030 0.0037
frequency: -52.6113 -27.0057 -12.8579 23.4227 32.6245 55.1634 74.4776 82.4769 100.8076 141.9530 144.0596 167.8566 169.0708 208.9815 214.1659 218.8350 223.1093 263.7512 291.2931 296.1589 321.7701 323.5136 358.5414 380.1436 406.9770 410.3899 465.2579 486.2243 536.2274 554.3749 590.3049 594.7671 623.4525 640.9813 677.8294 685.4584 703.1295 710.4039 734.1650 749.3320 764.4027 785.9417 811.9146 831.4015 844.7059 845.6838 903.9338 935.9752 936.2334 978.2708 979.4442 993.2447 1010.2477 1052.3125 1073.1717 1082.0434 1119.2545 1132.1006 1187.8301 1196.1972 1260.0697 1283.1473 1297.0206 1334.8164 1362.3855 1389.4287 1397.2883 1401.9449 1450.6625 1454.7833 1475.1426 1478.6101 1494.1541 1512.2642 1527.5205 1598.0927 1607.7917 1678.5183 3000.3958 3086.9797 3119.4135 3140.7000 3168.3180 3174.8074 3200.5580 3503.5726 3526.5913
redmass: 1.0157 5.0328 29.4997 9.0377 14.4805 5.4217 7.6014 11.5910 11.3012 5.8484 14.3635 5.4036 6.4735 7.5582 9.7350 10.3283 14.9504 9.4448 15.6520 5.7580 4.3955 13.3094 5.4683 21.1293 10.3864 3.0098 5.2236 1.8565 1.8322 6.5857 5.3345 7.0138 7.1882 3.3330 9.2541 1.9670 3.2657 4.6693 7.5987 10.6436 6.8844 7.1452 1.3968 9.0926 5.9688 1.4096 13.5145 1.3579 8.7344 2.5257 1.3195 4.1541 5.2544 1.6653 3.2601 2.6870 1.3497 2.8293 1.1158 7.5096 2.6019 3.8536 1.4143 4.6598 4.8710 3.9122 1.3430 4.1928 1.1911 1.2046 2.9069 3.5339 2.9491 2.8975 2.4477 5.0263 6.2511 5.5178 1.0401 1.0934 1.0903 1.1009 1.0913 1.0951 1.0952 1.0762 1.0761
irintensity: 0.4871 3.1915 0.1222 0.0883 0.0647 4.4045 0.2522 0.2889 1.5474 0.8623 1.2701 0.0251 0.5893 1.5570 0.9720 0.8670 0.5331 3.6631 0.0247 0.1806 0.2225 6.0355 2.2964 1.7978 33.2120 0.0250 8.6653 41.1614 1.1317 7.8130 24.3101 20.7324 0.7342 137.2779 67.1018 8.5350 5.0029 11.9796 35.3721 83.2555 144.0158 20.3733 47.5127 1.2916 18.3108 63.3731 26.4129 1.2184 36.8982 1.8955 2.7574 40.2325 32.6684 11.1860 102.6907 0.8728 29.5269 340.1968 2.9801 111.5593 118.4261 1.3736 29.5630 178.6109 268.3505 147.1266 104.9832 19.2044 51.8375 282.9332 1370.5506 59.8593 619.8009 98.5007 120.0269 27.7463 2.9057 204.8101 1.6316 7.8360 15.6590 5.8845 1.8066 2.5519 9.0391 15.7088 28.9219
temp: 298.150 k
press: 1.00000 atm
elementType: 17 17 17 17 8 7 7 7 7 7 6 6 6 6 6 6 6 6 6 6 6 6 1 1 1 1 1 1 1 1 1
symmnumber: 1
zpe: 526660.4 jmol-1
zpe.correction: 0.200594 hartree
zpe.thermalcorrener: 0.219548 hartree
zpe.thermalcorrenthalpy: 0.220492 hartree
zpe.thermalcorrgfe: 0.150964 hartree
zpe.sumelectzpe: -2650.328842 hartree
zpe.sumelectthermal: -2650.309888 hartree
zpe.sumelectthermalent: -2650.308944 hartree
zpe.sumelectthermalfe: -2650.378473 hartree
dipole: -1.3444 7.0116 0.0399
dipole: 7.1394
quadrupole: -173.8297 -136.6234 -156.2820
quadrupole: -1.8167 0.2727 0.1630
quadrupole: -18.2514 18.9550 -0.7036 -1.8167 0.2727 0.1630
hfenergy: -2650.5294363 hartree
pointgroup: C01 [X(C12H9Cl4N5O1)]
dipole: 0.3566052 2.7861073 -0.0148701 debye
polarizability: 377.4255488|-17.8240156|209.4851945|0.272482|-0.2297468|111.2580458 unknown
InChI: InChI=1S/C12H9Cl4N5O/c1-6-17-9(12(14,15)16)20-10(18-6)21-11(22)19-8-4-2-7(13)3-5-8/h2-5,19,21H,1H3
charge 0 multiplicity 1
31 atoms
Cl -5.149157 -2.013567 -1.515169
Cl -2.814972 -3.173827 0.002516
Cl -5.150449 -2.018641 1.52178
Cl 7.744019 -0.990693 -0.005604
O  0.729108 -0.921184 -0.004659
N  2.034976 1.042079 0.003263
N  -0.283322 1.231203 0.004564
N  -2.107185 -0.336897 0.00552
N  -2.433179 2.077502 0.008365
N  -4.34598 0.602551 0.008718
C  3.353831 0.502672 0.000922
C  -1.642803 0.95097 0.006125
C  -3.457423 -0.432697 0.005977
C  -3.781515 1.854395 0.007741
C  0.82835 0.326481 -0.000274
C  4.430556 1.430523 0.005162
C  3.629192 -0.890992 -0.005312
C  5.766223 0.983447 0.003205
C  4.967722 -1.337619 -0.007271
C  -4.07634 -1.839128 0.004271
C  6.018814 -0.402178 -0.003019
C  -4.694843 3.045916 -0.002796
H  1.993586 2.063621 0.008478
H  -0.114907 2.242301 0.006582
H  4.231363 2.509784 0.010016
H  2.805689 -1.606314 -0.008504
H  6.591884 1.700195 0.006462
H  5.1830 -2.409929 -0.012083
H  -4.342431 3.809875 0.709882
H  -4.693451 3.511969 -1.00595
H  -5.722058 2.737982 0.23949
