program: Gaussian 09
title: 000035505
version: EM64L-G09RevD.01
frameworkgroup: C1[X(C9H6Cl9N3O3)]
method: RPBEPBE
basis: SDD
operation: Freq
keyword: #p
keyword: freq=noraman
keyword: PBEPBE/SDD
title: #p freq=noraman PBEPBE/SDD
converged: YES YES NO NO
title: Mulliken charges:
elementType: Cl Cl Cl Cl Cl Cl Cl Cl Cl O O O N N N C C C C C C C C C H H H H H H
charge: 0.098341 0.174898 0.137544 0.097515 0.175014 0.138776 0.138259 0.097564 0.175162 -0.213328 -0.213319 -0.213673 -0.095392 -0.096316 -0.095794 -0.410969 -0.409084 -0.408163 0.478175 0.477235 0.478353 -0.764655 -0.764360 -0.764994 0.321317 0.273278 0.273131 0.321288 0.320869 0.273328
chargesum: 0.00000
title: Mulliken charges with hydrogens summed into heavy atoms:
elementType: Cl Cl Cl Cl Cl Cl Cl Cl Cl O O O N N N C C C C C C C C C
charge: 0.098341 0.174898 0.137544 0.097515 0.175014 0.138776 0.138259 0.097564 0.175162 -0.213328 -0.213319 -0.213673 -0.095392 -0.096316 -0.095794 0.183627 0.185335 0.186034 0.478175 0.477235 0.478353 -0.764655 -0.764360 -0.764994
polarizability: 2.33389862e+02 -2.29970451e-01 2.32705017e+02 -8.12261670e-03 3.77884931e-01 1.81087729e+02
1716.lowfreq: -2.9434 0.0018 0.0023 0.0030 3.9461 7.3554 18.3322 19.3872 22.9424
frequency: 18.3050 19.3798 22.9323 42.6799 48.1151 48.8051 70.8115 71.7439 77.8945 114.8379 120.1754 120.9397 146.3570 146.8287 165.2369 204.0901 205.2148 206.0215 230.6407 232.2426 255.0219 260.9852 261.3994 265.7197 268.7567 269.1950 292.0508 320.1044 322.9139 360.4991 362.4254 363.1827 386.3884 393.9229 394.2196 425.5207 479.7335 480.8810 554.2422 587.3496 588.4611 598.6442 637.1624 637.5387 713.4625 748.2455 748.7926 749.2972 760.9220 761.1300 769.3132 811.7247 812.6394 876.4647 942.5655 955.6686 957.2101 1000.1253 1001.0559 1095.8497 1114.5676 1190.9231 1191.6648 1208.8581 1211.0242 1230.5075 1349.3588 1362.8793 1364.6604 1378.0878 1393.3784 1394.8797 1462.3798 1464.6822 1470.8265 1595.4198 1595.8616 1610.1014 2960.7406 2962.6436 2967.3682 3149.8109 3150.4396 3152.5451
redmass: 22.3003 22.0601 20.3735 31.2818 23.1852 23.5034 19.4997 19.7373 15.5115 21.6114 14.0699 14.1351 21.7898 21.5877 27.9740 12.2307 13.0379 15.4592 9.2340 9.6231 17.2513 9.8476 10.2228 24.2389 22.7147 22.9730 11.8361 4.3390 4.5329 10.7743 6.3447 5.6410 22.2344 13.6659 13.4344 1.7032 7.6993 7.6031 8.5987 12.4647 12.4516 11.0043 8.4310 8.4259 9.3002 11.8478 11.8256 12.0826 11.4156 11.4851 12.0393 7.6065 7.6145 5.9151 5.0160 2.3028 2.2902 3.1802 3.1084 3.6565 6.3902 2.3029 2.3662 5.3664 5.4597 1.0298 1.2284 1.2581 1.2504 5.6513 1.8972 1.8711 1.0846 1.0849 1.1058 9.9936 10.1086 11.2279 1.0710 1.0708 1.0714 1.0913 1.0916 1.0956
irintensity: 0.1309 0.1512 0.0222 0.0821 0.2433 0.2030 0.6868 0.6975 3.2202 1.9360 0.5511 0.4044 3.3195 3.0445 2.5275 1.0360 0.8008 0.2348 2.1545 2.1642 0.1794 1.6534 1.7549 0.1714 1.2225 1.1923 0.1023 0.0694 0.1655 1.6832 2.0224 2.1076 4.0744 13.6382 14.0781 1.0538 9.9554 10.4112 0.5885 40.4248 38.5972 228.6069 59.0437 60.3949 85.4961 21.2966 18.0016 77.5084 233.8660 235.8657 7.8494 7.7362 7.4154 39.7917 29.4247 151.9444 151.7094 9.4360 7.4971 2.2821 4.1649 245.9196 234.5646 185.0732 168.6954 1.2870 5.9741 20.1064 19.9217 37.1107 53.8337 51.8343 13.3783 13.6202 14.4723 269.4696 269.7194 47.8571 3.0034 1.9467 63.9622 8.6959 8.5345 2.4576
temp: 298.150 k
press: 1.00000 atm
elementType: 17 17 17 17 17 17 17 17 17 8 8 8 7 7 7 6 6 6 6 6 6 6 6 6 1 1 1 1 1 1
symmnumber: 1
zpe: 411022.8 jmol-1
zpe.correction: 0.156550 hartree
zpe.thermalcorrener: 0.182696 hartree
zpe.thermalcorrenthalpy: 0.183640 hartree
zpe.thermalcorrgfe: 0.096016 hartree
zpe.sumelectzpe: -4875.150600 hartree
zpe.sumelectthermal: -4875.124455 hartree
zpe.sumelectthermalent: -4875.123511 hartree
zpe.sumelectthermalfe: -4875.211135 hartree
dipole: -0.0204 -0.0299 4.1307
dipole: 4.1309
quadrupole: -216.9431 -216.7608 -188.9472
quadrupole: 0.0418 -0.1058 -0.2036
quadrupole: -9.3927 -9.2104 18.6032 0.0418 -0.1058 -0.2036
hfenergy: -4875.3071505 hartree
pointgroup: C01 [X(C9H6Cl9N3O3)]
dipole: -0.0129318 -0.0317254 -1.6248463 debye
polarizability: 232.6761987|-0.1863544|233.4074987|-0.3938883|-0.7551945|181.0989109 unknown
InChI: InChI=1S/C9H6Cl9N3O3/c10-7(11,12)4(22)19-1-20(5(23)8(13,14)15)3-21(2-19)6(24)9(16,17)18/h1-3H2
charge 0 multiplicity 1
30 atoms
Cl 4.417796 0.033474 -1.090791
Cl 4.615775 1.989925 1.186347
Cl 3.110547 -0.577435 1.617875
Cl -2.228511 3.779606 -1.172258
Cl -3.960003 3.072287 1.184068
Cl -0.974584 3.068034 1.537862
Cl -2.080028 -2.374973 1.649553
Cl -2.147648 -3.841862 -1.045608
Cl -0.595641 -4.963008 1.274944
O  2.0532 2.706931 0.07519
O  -3.321048 0.443798 0.180223
O  1.324852 -3.105662 0.183828
N  1.216508 0.70629 -0.745144
N  -1.20283 0.691582 -0.730377
N  0.020025 -1.39895 -0.688726
C  -0.005818 1.414535 -1.201517
C  1.252017 -0.711144 -1.152412
C  -1.220729 -0.736749 -1.136264
C  2.189953 1.470091 -0.10427
C  -2.329413 1.175802 -0.06831
C  0.186869 -2.613598 -0.026425
C  3.502194 0.769336 0.385525
C  -2.368072 2.682717 0.356945
C  -1.082764 -3.398202 0.447795
H  0.040287 2.4461 -0.83611
H  -0.015435 1.422963 -2.311808
H  1.28505 -0.755905 -2.26159
H  2.114827 -1.250064 -0.746414
H  -2.122159 -1.197118 -0.717578
H  -1.266615 -0.787204 -2.244656
