program: Gaussian 09
title: 000035490
version: EM64L-G09RevD.01
frameworkgroup: C1[X(C12H9Cl3N6O3)]
method: RPBEPBE
basis: SDD
operation: Freq
keyword: #p
keyword: freq=noraman
keyword: PBEPBE/SDD
title: #p freq=noraman PBEPBE/SDD
converged: NO YES NO NO
title: Mulliken charges:
elementType: Cl Cl Cl O O O N N N N N N C C C C C C C C C C C C H H H H H H H H H
charge: 0.105792 0.155910 0.105963 -0.195680 -0.198176 -0.210090 -0.507857 -0.438875 0.043012 -0.097206 0.029581 0.019037 0.541374 -0.593724 0.428149 -0.338638 0.045623 -0.386640 0.275970 -0.171109 0.298186 0.080349 -0.775811 -0.741905 0.279937 0.308487 0.316383 0.289871 0.243710 0.333231 0.247913 0.253654 0.253583
chargesum: 0.00000
title: Mulliken charges with hydrogens summed into heavy atoms:
elementType: Cl Cl Cl O O O N N N N N N C C C C C C C C C C C C
charge: 0.105792 0.155910 0.105963 -0.195680 -0.198176 -0.210090 -0.199371 -0.105644 0.043012 -0.097206 0.029581 0.019037 0.541374 -0.313788 0.428149 -0.022255 0.045623 -0.096768 0.275970 0.072601 0.298186 0.080349 -0.775811 0.013244
polarizability: 3.73288245e+02 2.32854380e+01 2.32981619e+02 2.82383469e-02 -8.49437544e-02 1.13672662e+02
1716.lowfreq: -17.7286 -11.0881 -3.4093 -0.0019 -0.0016 -0.0012 3.9026 4.8554 26.3836
frequency: -17.7107 -9.9702 26.3822 35.0083 45.6672 52.7284 61.2295 82.7212 88.8775 91.3950 137.4258 167.7508 168.7315 185.0899 197.9531 209.7749 218.5297 218.8851 243.6519 250.6412 291.1737 299.8318 322.6837 335.2295 381.1979 401.1523 426.8152 465.2101 497.1930 509.7003 538.8625 559.3257 562.6496 594.0445 641.3914 646.1659 672.3755 681.7784 688.0840 705.1335 715.3858 729.6467 748.9128 765.9212 786.0191 790.2465 820.1812 832.2794 895.9249 904.4870 914.2159 943.4631 948.8866 977.4325 985.0994 1008.1872 1019.6189 1051.3605 1083.2673 1086.5350 1092.8869 1133.2499 1180.1782 1196.0037 1216.3463 1257.3784 1279.6031 1306.4890 1341.6301 1370.4620 1380.9065 1390.5678 1397.6462 1435.1649 1442.4138 1451.6997 1475.2550 1488.8332 1496.4648 1517.0686 1533.1685 1596.9060 1624.2745 1680.2679 3003.0881 3084.3040 3139.7940 3151.7828 3157.3625 3192.7209 3200.7343 3503.5147 3527.0371
redmass: 7.2743 23.9195 6.6613 11.2547 8.3838 1.0981 7.2367 10.8347 11.8233 5.8891 14.9704 4.9765 5.6269 5.2660 10.4376 7.6147 12.8969 11.1077 3.3375 13.0476 16.6219 5.8989 13.5623 6.4652 24.3903 8.9056 3.2840 5.3141 1.6989 7.6882 7.8350 2.8742 6.2246 4.8416 3.4649 7.7063 10.5375 2.2531 1.9138 5.8056 4.4723 9.3274 10.6489 7.0187 7.7596 8.0988 1.3835 9.0763 5.5485 13.0834 1.6191 8.4025 1.3699 2.6694 5.9476 1.3388 4.4720 1.6606 3.3971 1.8512 1.6191 2.8102 1.1684 7.4515 6.2561 2.1789 4.1956 1.7700 4.6743 6.1460 5.6539 3.9144 1.4217 3.6569 1.4819 1.0455 3.6570 2.8519 3.7771 2.5214 2.2839 4.9177 6.8008 5.3889 1.0381 1.0962 1.1004 1.0921 1.0898 1.0940 1.0965 1.0761 1.0763
irintensity: 0.0001 0.1617 0.2136 0.6452 11.5148 0.5427 0.3210 0.3338 3.9027 0.0589 0.7793 0.0633 0.0609 3.7080 0.7346 2.5715 1.1336 1.0921 1.0653 3.0514 0.0020 0.8537 5.4182 1.5805 0.2264 1.9543 0.9163 11.3277 16.6919 11.1623 18.5030 0.3778 15.1505 30.0258 129.1087 19.1670 13.2208 8.3923 21.3769 14.2384 35.6444 61.1135 115.1294 158.6440 12.4432 4.8076 38.1812 1.6564 8.3160 23.7825 50.9670 32.9906 0.2920 7.4376 0.9932 3.4237 30.1280 8.2721 20.5621 17.0207 20.4199 463.2046 28.6921 193.4885 229.8177 141.8091 3.5434 193.9808 175.8442 223.3061 67.0153 192.9862 150.7636 54.4933 193.3124 18.2869 1271.7393 375.9045 429.3539 186.5633 60.2110 23.9705 40.0245 173.1097 0.7318 4.7040 9.1507 8.4369 8.7725 8.5851 6.0761 17.2527 27.8991
temp: 298.150 k
press: 1.00000 atm
elementType: 17 17 17 8 8 8 7 7 7 7 7 7 6 6 6 6 6 6 6 6 6 6 6 6 1 1 1 1 1 1 1 1 1
symmnumber: 1
zpe: 555992.7 jmol-1
zpe.correction: 0.211766 hartree
zpe.thermalcorrener: 0.232857 hartree
zpe.thermalcorrenthalpy: 0.233801 hartree
zpe.thermalcorrgfe: 0.159193 hartree
zpe.sumelectzpe: -2395.241743 hartree
zpe.sumelectthermal: -2395.220653 hartree
zpe.sumelectthermalent: -2395.219708 hartree
zpe.sumelectthermalfe: -2395.294317 hartree
dipole: 1.2097 3.2666 0.0004
dipole: 3.4834
quadrupole: -214.1564 -144.4570 -158.0452
quadrupole: 23.3251 -0.0349 -0.0060
quadrupole: -41.9369 27.7626 14.1743 23.3251 -0.0349 -0.0060
hfenergy: -2395.4535097 hartree
pointgroup: C01 [X(C12H9Cl3N6O3)]
dipole: -0.5721239 -1.2453281 0.0004236 debye
polarizability: 376.0051654|12.3946794|230.2647362|-0.0036173|0.0592231|113.672624 unknown
InChI: InChI=1S/C12H9Cl3N6O3/c1-6-16-9(12(13,14)15)19-10(17-6)20-11(22)18-7-3-2-4-8(5-7)21(23)24/h2-5,18,20H,1H3
charge 0 multiplicity 1
33 atoms
Cl -5.979317 1.579091 1.518889
Cl -3.818747 3.027761 -0.007499
Cl -5.985757 1.572676 -1.51829
O  -0.004791 1.237755 0.001258
O  7.57146 -0.224685 -0.000607
O  6.280938 -2.104923 -0.002525
N  1.538098 -0.546053 -0.000206
N  -0.738311 -1.022473 0.000402
N  -2.745923 0.302937 -0.000788
N  -2.762425 -2.13459 0.001163
N  -4.845519 -0.913568 0.000144
N  6.427577 -0.820479 -0.001046
C  2.773768 0.156266 0.000199
C  3.954202 -0.627332 -0.000649
C  5.202894 0.020702 -0.000189
C  2.872229 1.576811 0.001454
C  -2.124277 -0.913679 0.000377
C  5.331353 1.42557 0.00106
C  0.246529 0.012255 0.000616
C  4.144854 2.186696 0.001862
C  -4.100321 0.225128 -0.000518
C  -4.126885 -2.085609 0.000875
C  -4.895813 1.539951 -0.002033
C  -4.894985 -3.3743 0.001381
H  3.930994 -1.722409 -0.001622
H  1.626378 -1.56474 -0.00128
H  1.961295 2.17722 0.002077
H  6.323414 1.882387 0.001385
H  4.205468 3.279555 0.002826
H  -0.445556 -2.005042 0.000925
H  -4.209855 -4.233749 0.008233
H  -5.559465 -3.417183 0.882576
H  -5.548907 -3.423946 -0.887447
