program: Gaussian 09
title: 000035429
version: EM64L-G09RevD.01
frameworkgroup: C1[X(C12H15NO2)]
method: RPBEPBE
basis: SDD
operation: Freq
keyword: #p
keyword: freq=noraman
keyword: PBEPBE/SDD
title: #p freq=noraman PBEPBE/SDD
converged: YES YES NO NO
title: Mulliken charges:
elementType: O O N C C C C C C C C C C C C H H H H H H H H H H H H H H H
charge: -0.450848 -0.283974 -0.393962 -0.356151 -0.396186 -0.314365 0.243658 0.471666 -0.380781 -0.236263 -0.372140 -0.385812 -0.235168 -0.234172 -0.236002 0.222231 0.250570 0.263887 0.205613 0.190547 0.178487 0.289582 0.203006 0.266035 0.222315 0.237994 0.227125 0.230584 0.340697 0.231826
chargesum: 0.00000
title: Mulliken charges with hydrogens summed into heavy atoms:
elementType: O O N C C C C C C C C C C C C
charge: -0.110150 -0.283974 -0.104380 0.116650 0.073315 0.054668 0.243658 0.471666 -0.177775 0.029772 -0.149825 -0.147818 -0.008043 -0.003588 -0.004176
polarizability: 2.60862453e+02 1.29169354e+01 1.26472965e+02 2.11044987e+01 -2.23458351e+01 9.56352033e+01
1716.lowfreq: -2.9814 -0.0006 -0.0005 0.0002 2.0678 7.9107 12.0187 28.0665 36.9552
frequency: 11.2311 28.0491 36.9408 67.4058 81.9942 93.9377 112.3428 163.0561 207.7385 236.7443 258.1704 273.6483 278.6302 306.8848 377.9316 402.8229 476.3438 495.7289 507.1897 534.3214 568.6003 616.0326 679.5745 691.3845 701.2576 774.0606 786.1478 830.5621 846.0387 871.3680 874.6156 904.8730 924.0558 965.2822 977.5638 987.5482 990.5969 995.2252 1012.6071 1026.1695 1058.0188 1083.0110 1089.7788 1108.5149 1173.5318 1183.1599 1185.9895 1191.1485 1212.0586 1216.4696 1271.7938 1283.2123 1293.8638 1322.0692 1332.6534 1334.4641 1363.3279 1386.0539 1410.3847 1440.1496 1443.2872 1463.9908 1478.9118 1484.9294 1487.5950 1582.9060 1584.9847 1611.3102 1656.0023 2916.8083 2968.1523 2994.7113 3009.7996 3072.1416 3082.7074 3096.0505 3104.6996 3123.8891 3127.2510 3139.9802 3150.6241 3166.6247 3554.9801 3566.1415
redmass: 4.2086 6.2765 4.9046 2.4973 3.7004 4.4239 3.3195 2.9524 4.0621 4.8698 2.6489 1.2140 3.2610 3.2797 3.5580 2.7542 1.7725 4.0142 1.6051 2.9277 5.6068 6.4210 3.6668 3.5808 1.7751 2.0067 1.6675 2.3643 1.2941 2.1348 1.8658 2.6616 1.4468 3.7176 1.3884 5.0719 4.4371 1.3120 1.2255 2.2051 2.1511 1.6037 3.0792 1.9043 1.0673 1.2007 1.4858 1.1742 1.3329 1.6829 1.2587 1.1585 1.9613 1.5606 1.3217 1.2758 1.2882 6.9204 1.4508 2.2651 1.1690 1.1040 1.7558 1.1074 2.1939 5.6974 6.7586 5.9697 5.6521 1.0555 1.1049 1.0636 1.0616 1.0987 1.1030 1.0923 1.0877 1.0854 1.0874 1.0916 1.0964 1.1016 1.0777 1.0665
irintensity: 0.5192 0.4077 5.3397 12.7919 4.5835 2.5050 0.4389 0.1608 2.7652 8.5271 22.5914 138.0063 4.6933 9.1266 28.8037 0.0505 54.7788 16.6349 27.0650 45.0409 16.4503 0.1529 6.0225 3.0163 43.5238 64.8994 14.9679 1.1908 1.0972 4.2342 17.6140 4.8739 0.0022 21.5598 0.2499 43.4937 39.5285 5.3128 40.8557 4.6226 5.8569 11.3929 11.2279 3.3586 0.1511 11.5806 65.3159 27.0828 93.2806 42.4728 24.5573 4.6367 26.1557 47.8899 31.8776 1.9323 2.0179 9.5597 2.9356 15.5365 47.6576 11.1495 154.8194 4.3960 142.9809 10.8317 162.7528 1.3028 89.5194 74.9009 69.3966 55.4310 31.7476 14.4333 37.1740 1.2996 16.7102 5.5741 1.0587 7.9943 41.6821 28.0548 17.8701 2.0549
temp: 298.150 k
press: 1.00000 atm
elementType: 8 8 7 6 6 6 6 6 6 6 6 6 6 6 6 1 1 1 1 1 1 1 1 1 1 1 1 1 1 1
symmnumber: 1
zpe: 644684.4 jmol-1
zpe.correction: 0.245547 hartree
zpe.thermalcorrener: 0.260875 hartree
zpe.thermalcorrenthalpy: 0.261819 hartree
zpe.thermalcorrgfe: 0.199522 hartree
zpe.sumelectzpe: -670.347958 hartree
zpe.sumelectthermal: -670.332630 hartree
zpe.sumelectthermalent: -670.331686 hartree
zpe.sumelectthermalfe: -670.393984 hartree
dipole: 1.2191 4.4872 -2.9123
dipole: 5.4866
quadrupole: -78.3898 -85.6908 -91.0417
quadrupole: -8.7746 13.0566 -4.0992
quadrupole: 6.6509 -0.6500 -6.0009 -8.7746 13.0566 -4.0992
hfenergy: -670.5935054 hartree
pointgroup: C01 [X(C12H15N1O2)]
dipole: -0.4912561 1.7272269 1.1978617 debye
polarizability: 261.4740257|-11.6737528|124.9116051|19.1896283|23.5012429|96.5849898 unknown
InChI: InChI=1S/C12H15NO2/c14-10-4-9-13-12(15)8-7-11-5-2-1-3-6-11/h1-3,5-8,13-14H,4,9-10H2
charge 0 multiplicity 1
30 atoms
O  5.722344 1.646894 -1.252018
O  1.454558 -1.939684 -0.307436
N  2.364438 -0.232615 0.990666
C  4.577959 -0.214631 -0.238308
C  3.731952 -0.777428 0.928425
C  4.850287 1.287498 -0.121733
C  1.297544 -0.860071 0.350356
C  -2.504396 -0.141524 -0.04064
C  -0.015982 -0.170594 0.506236
C  -1.137698 -0.682397 -0.081984
C  -2.858027 1.041008 0.673445
C  -3.529731 -0.830158 -0.750599
C  -4.184535 1.51351 0.672809
C  -4.858823 -0.357601 -0.752101
C  -5.192329 0.817499 -0.04012
H  5.548232 -0.746609 -0.261012
H  4.066549 -0.42335 -1.194578
H  3.633172 -1.869145 0.799673
H  4.232235 -0.586049 1.897823
H  3.894452 1.854389 -0.165478
H  5.350561 1.510923 0.848149
H  2.193861 0.630217 1.508703
H  -0.047157 0.753002 1.100827
H  -0.988271 -1.609374 -0.655882
H  -2.09284 1.591899 1.231842
H  -3.272638 -1.741503 -1.304062
H  -4.439568 2.423789 1.227048
H  -5.631564 -0.902281 -1.305513
H  5.884535 2.623714 -1.250447
H  -6.223323 1.188073 -0.038194
