program: Gaussian 09
title: 000035448
version: EM64L-G09RevD.01
frameworkgroup: C1[X(C12H15NO2)]
method: RPBEPBE
basis: SDD
operation: Freq
keyword: #p
keyword: freq=noraman
keyword: PBEPBE/SDD
title: #p freq=noraman PBEPBE/SDD
converged: YES YES NO NO
title: Mulliken charges:
elementType: O O N C C C C C C C C C C C C H H H H H H H H H H H H H H H
charge: -0.448911 -0.284997 -0.414320 0.326451 0.307957 -0.361944 -0.223254 -0.367274 -0.412091 -0.828970 -0.255974 -0.227100 -0.392682 -0.313927 0.236381 0.222559 0.238380 0.275016 0.220447 0.232644 0.230548 0.241590 0.241162 0.301076 0.229364 0.205409 0.230472 0.221068 0.233905 0.337017
chargesum: 0.00000
title: Mulliken charges with hydrogens summed into heavy atoms:
elementType: O O N C C C C C C C C C C C C
charge: -0.111895 -0.284997 -0.113244 0.326451 0.307957 0.098995 0.051762 -0.146827 -0.179447 -0.115670 -0.026610 0.003372 -0.187273 0.141046 0.236381
polarizability: 2.61968040e+02 -4.43994835e+00 1.45771335e+02 1.53554821e+01 4.99335028e+00 7.78512659e+01
1716.lowfreq: -10.9707 -5.5653 0.0004 0.0010 0.0010 4.5974 15.1717 39.6575 46.2088
frequency: 13.4459 39.5693 46.1036 68.1672 91.7428 110.0053 154.2418 174.6469 186.3397 213.7367 230.2284 261.5684 296.1623 311.1075 344.9293 402.0826 446.1074 488.1292 496.4687 515.8187 530.8845 544.7851 595.0358 680.2987 695.7279 731.2608 769.7658 772.7926 825.6531 856.3414 867.5608 870.7186 872.0920 951.4863 954.4360 988.3247 989.8134 1000.3551 1009.9035 1043.3192 1048.8183 1075.0621 1084.1197 1103.8806 1174.7665 1176.2619 1192.4527 1199.3123 1234.6095 1264.4668 1294.5061 1304.7280 1327.9525 1331.7288 1351.1325 1369.9523 1379.1753 1401.9765 1425.0847 1438.1974 1467.5866 1470.5478 1475.4776 1479.3243 1487.2417 1574.9066 1580.1158 1611.6271 1649.5001 2980.9269 2998.9115 3008.4988 3058.8233 3078.0485 3088.3614 3091.2150 3103.1445 3123.0091 3124.1475 3130.8796 3144.8479 3163.6516 3556.0030 3557.1459
redmass: 4.4354 5.6876 4.9915 3.5995 4.9858 3.0788 2.2846 1.1109 3.0181 4.1830 4.3261 3.7904 2.5423 1.5123 2.2302 2.8240 2.6025 2.4698 3.9530 2.6480 1.6499 2.7804 6.1031 4.0363 4.6425 2.0048 2.2694 2.6010 3.3591 3.3533 2.3582 1.5764 1.6573 1.3919 2.7561 1.5942 1.3427 2.9868 1.1837 1.5742 2.1506 2.2581 3.0125 1.9149 1.2533 1.0804 2.0796 1.5963 2.2475 1.2250 1.5857 1.8495 1.2585 1.3233 1.3152 1.2322 4.3235 1.2733 1.1743 2.1160 1.0970 1.8666 1.0525 1.7363 1.3972 6.0122 6.8522 5.9575 5.3883 1.0377 1.0636 1.0597 1.0974 1.1019 1.0986 1.1038 1.0922 1.0856 1.0865 1.0884 1.0942 1.1009 1.0698 1.0741
irintensity: 1.4718 0.4659 9.5519 0.4203 5.3162 4.8681 1.7014 1.1574 0.0553 2.5357 2.4886 28.3922 48.3022 111.8227 54.4722 19.8628 10.7044 3.1682 9.2570 13.2921 16.2247 14.8826 14.3777 0.2284 4.5083 16.7984 33.0319 40.8090 7.5301 17.6472 11.7693 12.5661 8.9713 0.1137 13.6404 0.7767 0.5145 79.3647 47.6202 6.9932 7.4063 3.4424 15.8577 5.4733 26.9730 0.7338 110.0695 36.1857 25.5810 11.3417 4.5980 90.4162 10.0215 19.5821 6.3569 27.9002 13.6905 18.2582 45.0238 4.2566 12.4077 157.5716 15.2269 125.6780 56.1882 16.8134 173.4181 5.6350 99.6456 19.9053 31.2173 37.0145 15.2906 14.6324 23.7468 49.5372 13.5568 7.9983 5.0936 1.8753 33.5428 33.7586 4.3916 24.0567
temp: 298.150 k
press: 1.00000 atm
elementType: 8 8 7 6 6 6 6 6 6 6 6 6 6 6 6 1 1 1 1 1 1 1 1 1 1 1 1 1 1 1
symmnumber: 1
zpe: 643730.2 jmol-1
zpe.correction: 0.245184 hartree
zpe.thermalcorrener: 0.260673 hartree
zpe.thermalcorrenthalpy: 0.261617 hartree
zpe.thermalcorrgfe: 0.200112 hartree
zpe.sumelectzpe: -670.355243 hartree
zpe.sumelectthermal: -670.339754 hartree
zpe.sumelectthermalent: -670.338810 hartree
zpe.sumelectthermalfe: -670.400315 hartree
dipole: 2.6983 -2.2635 -1.0848
dipole: 3.6853
quadrupole: -89.5609 -84.5419 -93.4701
quadrupole: 1.8448 9.9177 3.9089
quadrupole: -0.3699 4.6491 -4.2791 1.8448 9.9177 3.9089
hfenergy: -670.600427 hartree
pointgroup: C01 [X(C12H15N1O2)]
dipole: 1.0728772 -0.7520199 -0.620974 debye
polarizability: 262.9522505|-2.4329343|140.9572481|8.5683346|18.0958381|81.6811422 unknown
InChI: InChI=1S/C12H15NO2/c1-10-4-2-3-5-11(10)6-7-12(15)13-8-9-14/h2-7,13-14H,8-9H2,1H3
charge 0 multiplicity 1
30 atoms
O  -5.169648 -1.389829 1.102981
O  -2.196972 1.563424 -0.068796
N  -3.054006 -0.465899 -0.81572
C  1.872866 0.024961 -0.243683
C  2.91203 0.945957 0.126228
C  -4.444652 0.022927 -0.822716
C  0.4695 0.462944 -0.218055
C  2.233568 -1.300422 -0.627199
C  4.257565 0.503221 0.097108
C  2.608231 2.375741 0.545471
C  3.575078 -1.721369 -0.64987
C  4.597147 -0.813089 -0.28476
C  -0.644095 -0.259732 -0.547264
C  -5.087356 -0.018225 0.579313
C  -1.993366 0.36503 -0.452462
H  -5.028764 -0.610357 -1.513548
H  -4.45133 1.065796 -1.191135
H  0.265026 1.493245 0.102418
H  1.44903 -2.011033 -0.909962
H  5.05181 1.204459 0.378933
H  3.540176 2.917474 0.778132
H  2.084685 2.937351 -0.250346
H  1.966029 2.41494 1.445073
H  -2.856569 -1.399421 -1.178512
H  3.826371 -2.745169 -0.947598
H  -0.582898 -1.302698 -0.886506
H  5.64671 -1.127255 -0.297401
H  -6.131794 0.3298 0.51916
H  -4.524364 0.644539 1.264994
H  -4.246306 -1.705511 1.275921
