program: Gaussian 09
title: 000035452
version: EM64L-G09RevD.01
frameworkgroup: C1[X(C12H13ClN2O3)]
method: RPBEPBE
basis: SDD
operation: Freq
keyword: #p
keyword: freq=noraman
keyword: PBEPBE/SDD
title: #p freq=noraman PBEPBE/SDD
converged: YES YES NO NO
title: Mulliken charges:
elementType: Cl O O O N N C C C C C C C C C C C C H H H H H H H H H H H H H
charge: -0.048752 -0.320398 -0.289958 -0.273670 -0.386146 -0.617064 -0.381041 -0.246437 0.500535 0.244598 -0.243569 -0.375609 -0.362686 -0.379435 -0.217502 -0.221700 -0.107489 0.307505 0.231904 0.259741 0.234282 0.245817 0.306574 0.270506 0.205099 0.229323 0.244658 0.255895 0.258907 0.332153 0.343956
chargesum: 0.00000
title: Mulliken charges with hydrogens summed into heavy atoms:
elementType: Cl O O O N N C C C C C C C C C C C C
charge: -0.048752 -0.320398 -0.289958 -0.273670 -0.079571 0.059045 0.110603 0.233662 0.500535 0.244598 0.026937 -0.170510 -0.133362 -0.134777 0.038394 0.037208 -0.107489 0.307505
polarizability: 3.10114857e+02 -1.98909288e+01 1.62502610e+02 1.15810962e+01 1.82555957e+01 9.06064412e+01
1716.lowfreq: -4.0833 -0.8832 -0.0022 -0.0014 -0.0007 5.5059 13.5579 19.4898 29.7392
frequency: 12.9480 19.1091 29.7275 35.9371 58.8968 66.6010 73.4661 134.9760 165.4782 177.5023 180.7710 190.2939 232.4810 243.9418 297.3688 341.9006 352.4834 410.3248 412.8591 431.5706 473.4004 496.0754 500.1306 511.4872 513.9741 585.1610 616.6888 626.8267 632.9769 677.1811 704.2299 711.3046 725.9992 772.1616 824.8708 826.8712 830.3278 881.8071 885.0131 941.6567 954.3551 967.0293 980.6291 998.3824 1012.9197 1036.7771 1057.7594 1073.7254 1086.7546 1108.9756 1111.3764 1187.3640 1193.1497 1207.0431 1216.9417 1251.3618 1289.8900 1293.8841 1306.5154 1323.9415 1358.4183 1374.2954 1377.5647 1404.2339 1458.7762 1469.8961 1478.3632 1484.7991 1574.0889 1582.6702 1590.2641 1599.3944 1656.4606 1692.8161 2993.0889 3019.4646 3071.8687 3092.7091 3099.2321 3107.0132 3137.1520 3143.2659 3170.5956 3174.6575 3556.8236 3559.2667 3715.9783
redmass: 7.9096 4.4431 6.8783 5.6918 4.7974 6.2841 6.3120 5.2052 6.6476 4.9402 4.7669 2.8298 5.4580 9.0518 3.3122 3.7998 3.5416 2.8515 7.0105 3.0067 3.0943 2.7673 1.2271 1.1009 2.7255 1.3007 4.7773 6.9650 6.2393 3.8940 10.5785 3.9155 3.6993 3.0809 1.2973 4.2869 1.5489 1.9154 2.6314 3.2861 1.3481 1.3709 4.2181 4.0382 1.2063 3.3382 2.1322 2.8521 2.1157 1.4925 2.5405 1.1346 1.6023 1.1647 1.7260 1.2528 1.7745 1.9934 1.6341 1.4208 1.4763 2.3104 2.5313 3.3799 1.1176 1.0832 2.1457 2.1550 7.1184 7.1588 1.2110 6.1268 5.6519 7.6060 1.0647 1.0579 1.0969 1.1089 1.0930 1.0876 1.0901 1.0885 1.0960 1.0964 1.0772 1.0447 1.1058
irintensity: 1.7106 0.5367 4.1344 1.2771 4.9624 0.1634 2.0120 4.5346 8.6408 0.9654 12.1354 5.3262 7.7806 5.5799 0.9389 9.6508 23.3044 0.0603 9.3016 7.2819 2.6098 37.1668 323.6773 13.5094 0.6953 111.1220 9.8797 0.9789 5.0565 2.0969 33.7114 9.0261 0.8285 29.3160 7.2810 11.5509 83.3228 6.8184 3.7114 68.5266 2.0660 0.4506 72.8201 38.0914 47.4122 104.8345 36.8457 82.3192 15.9120 18.0198 1.7086 0.2257 96.0591 5.9940 32.0548 195.3684 109.9172 321.9699 33.8437 17.6577 28.6101 54.0551 21.4602 12.3658 50.1880 11.8495 21.1216 401.8969 1.0011 198.8001 104.8557 14.3184 88.1970 374.4446 52.8437 19.8126 11.2658 31.9247 2.1812 14.7376 7.1637 6.6383 6.8258 2.0048 31.2425 64.5680 52.3647
temp: 298.150 k
press: 1.00000 atm
elementType: 17 8 8 8 7 7 6 6 6 6 6 6 6 6 6 6 6 6 1 1 1 1 1 1 1 1 1 1 1 1 1
symmnumber: 1
zpe: 617325.2 jmol-1
zpe.correction: 0.235127 hartree
zpe.thermalcorrener: 0.253204 hartree
zpe.thermalcorrenthalpy: 0.254149 hartree
zpe.thermalcorrgfe: 0.184130 hartree
zpe.sumelectzpe: -1259.013146 hartree
zpe.sumelectthermal: -1258.995069 hartree
zpe.sumelectthermalent: -1258.994125 hartree
zpe.sumelectthermalfe: -1259.064143 hartree
dipole: -0.9772 -3.8237 -3.0151
dipole: 4.9665
quadrupole: -122.6439 -104.8469 -116.4418
quadrupole: 16.9574 17.9970 7.4868
quadrupole: -7.9997 9.7973 -1.7976 16.9574 17.9970 7.4868
hfenergy: -1259.2482732 hartree
pointgroup: C01 [X(C12H13Cl1N2O3)]
dipole: -0.3689185 -1.214881 -1.4852488 debye
polarizability: 309.538971|-23.429137|151.945574|10.5841896|31.1391736|101.7393638 unknown
InChI: InChI=1S/C12H13ClN2O3/c13-10-4-1-9(2-5-10)3-6-11(16)15-7-8-18-12(14)17/h1-6,15H,7-8,14H2
charge 0 multiplicity 1
31 atoms
Cl 7.073179 -1.497764 -0.136652
O  -4.542306 -0.591172 -0.587911
O  -0.912081 2.555837 0.609272
O  -6.150877 -1.448773 0.908709
N  -2.064213 0.871072 -0.519401
N  -5.555858 -2.575267 -1.065446
C  -3.37631 1.50813 -0.374379
C  -4.387504 0.590419 0.309458
C  2.847244 0.426608 0.125677
C  -0.902416 1.437867 -0.002055
C  1.536856 1.080293 0.242875
C  0.333477 0.632371 -0.223151
C  3.046747 -0.820205 -0.53688
C  3.981947 1.065799 0.702961
C  4.323544 -1.406664 -0.619525
C  5.268497 0.492999 0.630447
C  5.420093 -0.739894 -0.032298
C  -5.487862 -1.546388 -0.151346
H  -3.769096 1.815889 -1.363025
H  -3.222918 2.41731 0.233853
H  -5.368709 1.083766 0.427782
H  -4.034465 0.246811 1.297145
H  -2.029856 -0.036881 -0.985939
H  1.50844 2.045673 0.769752
H  0.238259 -0.319524 -0.763336
H  2.199185 -1.341478 -0.994306
H  3.852275 2.025249 1.21697
H  4.469739 -2.363268 -1.12925
H  6.131881 0.992646 1.078444
H  -4.997283 -2.556245 -1.914776
H  -6.200606 -3.339914 -0.886672
