program: Gaussian 09
title: 000035431
version: EM64L-G09RevD.01
frameworkgroup: C1[X(C13H17NO3)]
method: RPBEPBE
basis: SDD
operation: Freq
keyword: #p
keyword: freq=noraman
keyword: PBEPBE/SDD
title: #p freq=noraman PBEPBE/SDD
converged: YES YES NO NO
title: Mulliken charges:
elementType: O O O N C C C C C C C C C C C C C H H H H H H H H H H H H H H H H H
charge: -0.447418 -0.429267 -0.285938 -0.485030 0.287437 -0.391044 -0.392494 -0.708869 0.236881 -0.404675 -0.229449 0.471795 -0.369720 -0.384205 -0.235395 -0.234276 -0.233388 0.244480 0.218270 0.218494 0.224358 0.274551 0.229445 0.207754 0.305050 0.347987 0.330080 0.209743 0.266000 0.223937 0.238441 0.229857 0.232559 0.234049
chargesum: 0.00000
title: Mulliken charges with hydrogens summed into heavy atoms:
elementType: O O O N C C C C C C C C C C C C C
charge: -0.099431 -0.099187 -0.285938 -0.179980 0.287437 0.071706 0.050358 0.002881 0.236881 -0.194932 0.036551 0.471795 -0.145783 -0.145764 -0.005537 -0.001718 0.000661
polarizability: 2.88256130e+02 1.56755509e+00 1.43691328e+02 4.95382811e+00 1.62711624e+01 9.82807189e+01
1716.lowfreq: -4.3052 0.0003 0.0005 0.0007 4.2942 14.1150 27.2780 33.2692 49.3018
frequency: 27.2429 33.2281 49.2822 64.6747 84.6431 98.1504 125.4626 152.4296 169.2333 184.6157 194.2811 215.9896 232.7334 249.7975 255.8451 276.9753 287.7025 338.5807 366.2440 402.6827 406.3386 451.8614 488.7168 497.6518 528.1744 566.0153 601.9492 615.6062 683.4743 702.8158 722.0903 775.5171 780.6170 842.8961 847.6668 876.0108 878.2782 915.6628 926.8078 938.5180 963.4598 979.9556 982.6730 986.9066 991.5258 997.9132 999.7342 1014.8340 1026.6923 1084.0854 1111.5418 1134.1023 1172.6302 1174.3938 1179.3447 1191.5114 1216.6768 1237.2969 1255.8520 1294.4027 1295.9828 1324.2354 1334.8203 1340.8044 1361.8216 1375.6831 1386.6948 1389.7175 1440.5825 1450.7431 1457.4795 1472.7513 1481.8687 1486.0061 1489.1186 1581.3982 1582.8834 1611.2442 1652.5282 2963.9719 2996.1900 3007.7500 3081.4949 3087.6828 3092.3297 3094.6567 3104.7140 3122.8201 3125.2717 3128.2516 3140.7351 3151.8613 3167.8369 3502.9343 3542.9824 3576.1560
redmass: 4.2569 5.0488 5.5025 5.3856 3.9496 5.5827 3.6011 3.1652 3.6321 1.6930 1.2601 3.0431 1.1692 1.4819 3.6942 3.1363 4.4118 3.0037 3.0997 2.7595 2.9353 3.8613 2.5472 3.3087 1.3011 6.2861 4.4090 6.4294 3.3090 1.8438 5.7288 2.0334 3.7061 4.0704 1.2936 1.8322 2.1003 1.9479 1.4351 1.8947 2.3328 1.3901 3.2642 4.7884 4.5963 1.3153 2.7829 1.2302 2.1820 1.6017 1.4936 1.3645 2.4841 1.0763 1.6000 1.1265 1.5840 2.5765 1.8689 1.5584 1.5304 1.6049 1.2641 1.2537 1.2691 1.2023 7.0829 1.2233 2.2669 1.3951 1.1021 1.0759 1.2497 1.7447 1.2869 5.6226 5.7823 5.9593 5.5679 1.0686 1.0380 1.0586 1.1051 1.0967 1.0970 1.0916 1.0886 1.1006 1.0858 1.0873 1.0916 1.0964 1.1016 1.0766 1.0660 1.0663
irintensity: 0.0068 0.9809 4.5559 3.9663 18.4690 2.5598 6.7187 5.1738 3.2967 32.9375 3.9942 48.6393 155.0556 81.1306 8.1141 3.1643 11.7711 9.9516 14.0927 0.0237 7.2595 10.0223 23.9137 2.9759 26.8246 20.9192 14.2203 0.2521 15.9333 33.9470 2.8352 73.4479 9.1553 1.8781 1.1721 21.6458 10.3901 0.9760 0.0146 6.9199 42.5492 0.2271 70.5202 13.0858 18.6967 4.3668 60.1805 44.2271 4.8952 11.2261 23.8138 28.6853 1.8750 3.2285 163.7384 12.7002 21.6052 66.5597 25.1646 12.1357 63.7847 48.4438 9.7734 17.1073 24.0278 38.1470 10.6829 37.0748 16.9836 220.0430 19.1907 15.8562 64.7042 50.5088 44.5091 176.5651 12.9963 0.2232 113.3065 45.2933 23.5052 37.1860 7.9230 11.5828 60.4678 0.3902 14.2785 4.1931 5.2217 1.6395 6.4122 38.1650 27.8131 19.1527 2.9192 5.8180
temp: 298.150 k
press: 1.00000 atm
elementType: 8 8 8 7 6 6 6 6 6 6 6 6 6 6 6 6 6 1 1 1 1 1 1 1 1 1 1 1 1 1 1 1 1 1
symmnumber: 1
zpe: 725271.9 jmol-1
zpe.correction: 0.276241 hartree
zpe.thermalcorrener: 0.294271 hartree
zpe.thermalcorrenthalpy: 0.295215 hartree
zpe.thermalcorrgfe: 0.229009 hartree
zpe.sumelectzpe: -784.706627 hartree
zpe.sumelectthermal: -784.688598 hartree
zpe.sumelectthermalent: -784.687654 hartree
zpe.sumelectthermalfe: -784.753860 hartree
dipole: 3.8558 1.4045 0.7688
dipole: 4.1750
quadrupole: -94.8562 -102.1133 -110.4977
quadrupole: 6.3076 2.1031 3.7832
quadrupole: 7.6329 0.3757 -8.0086 6.3076 2.1031 3.7832
hfenergy: -784.9828687 hartree
pointgroup: C01 [X(C13H17N1O3)]
dipole: -1.5151215 -0.5569275 0.3037977 debye
polarizability: 288.1467996|1.2707465|144.4497186|-6.8099674|-15.1520582|97.6316587 unknown
InChI: InChI=1S/C13H17NO3/c1-13(9-15,10-16)14-12(17)8-7-11-5-3-2-4-6-11/h2-8,14-16H,9-10H2,1H3
charge 0 multiplicity 1
34 atoms
O  3.441472 0.636186 2.262929
O  4.143065 -2.307119 -0.944827
O  1.110485 1.688244 -0.688263
N  2.05163 -0.369463 -0.07259
C  3.493762 0.014321 -0.176305
C  3.832855 1.074518 0.915955
C  4.308553 -1.278941 0.092484
C  3.827831 0.589239 -1.571405
C  0.967736 0.479463 -0.309294
C  -0.364726 -0.149953 -0.074834
C  -1.508374 0.577736 -0.250868
C  -2.898021 0.134978 -0.074469
C  -3.255657 -1.183627 0.334285
C  -3.94385 1.070249 -0.323101
C  -4.606998 -1.547807 0.487033
C  -5.297805 0.706075 -0.170657
C  -5.635275 -0.60546 0.235451
H  3.352928 2.034246 0.647307
H  4.926723 1.212525 0.963804
H  4.048594 -1.677494 1.096705
H  5.384219 -1.040143 0.081627
H  3.163575 1.43324 -1.812214
H  3.724808 -0.189684 -2.345439
H  4.876347 0.94052 -1.584888
H  1.846982 -1.250208 0.408763
H  2.470812 0.793405 2.374996
H  3.179521 -2.400924 -1.159534
H  -0.393959 -1.20484 0.230632
H  -1.357972 1.621584 -0.565857
H  -2.474691 -1.926143 0.533207
H  -3.68341 2.088015 -0.638283
H  -4.865464 -2.564969 0.801688
H  -6.086609 1.440222 -0.367102
H  -6.685587 -0.892891 0.355064
