program: Gaussian 09
title: 000035436
version: EM64L-G09RevD.01
frameworkgroup: C1[X(C14H19NO4)]
method: RPBEPBE
basis: SDD
operation: Freq
keyword: #p
keyword: freq=noraman
keyword: PBEPBE/SDD
title: #p freq=noraman PBEPBE/SDD
converged: YES YES NO NO
title: Mulliken charges:
elementType: O O O O N C C C C C C C C C C C C C C H H H H H H H H H H H H H H H H H H H
charge: -0.446763 -0.448371 -0.356107 -0.257908 -0.145620 -0.426128 -0.420370 0.277435 -0.317059 -0.287279 -0.335355 0.494798 -0.284226 -0.357261 -0.394802 0.323170 -0.361529 -0.368263 -0.536572 0.246545 0.251541 0.262139 0.196750 0.216178 0.202808 0.204681 0.181881 0.221750 0.273634 0.229241 0.237867 0.253385 0.244825 0.352675 0.371741 0.226022 0.249195 0.225351
chargesum: 0.00000
title: Mulliken charges with hydrogens summed into heavy atoms:
elementType: O O O O N C C C C C C C C C C C C C C
charge: -0.094089 -0.076630 -0.356107 -0.257908 -0.145620 0.071957 0.038519 0.277435 0.101928 0.099283 -0.113605 0.494798 -0.010592 -0.128020 -0.156935 0.323170 -0.108144 -0.123439 0.163997
polarizability: 3.57134006e+02 2.29979302e+00 1.75319401e+02 9.23253004e-01 9.49687403e+00 9.77342939e+01
1716.lowfreq: -8.2620 -0.0007 -0.0004 0.0002 2.4197 5.6525 22.3158 31.3503 36.8648
frequency: 21.6689 31.3242 36.8448 42.3578 67.3297 72.9667 105.6445 115.0022 120.4380 143.0036 167.4837 188.1328 197.2546 237.6685 241.3119 252.9220 265.0589 284.4346 306.6326 347.5347 374.2361 391.0323 418.1519 431.5423 462.9144 480.1188 515.7381 532.4561 545.1692 633.0330 661.1441 684.4196 726.1451 738.0554 743.5601 787.6573 814.1492 819.4106 833.5363 853.6817 861.6911 870.7890 928.0445 946.7224 966.8125 979.2156 983.7093 997.8201 999.2742 1008.8370 1025.8479 1037.3481 1059.4921 1110.8708 1112.6312 1114.6901 1156.8081 1163.0586 1178.4533 1184.9525 1209.6904 1214.0889 1218.4303 1244.5648 1260.6291 1285.6632 1294.6409 1310.8872 1321.0203 1338.8179 1344.7724 1347.4058 1378.4012 1411.8404 1415.3918 1432.9220 1436.9475 1441.6963 1451.2044 1467.6191 1468.3310 1471.4087 1484.7921 1501.0831 1503.3934 1537.0348 1569.3191 1619.1597 1637.8449 2929.5185 2947.1922 2965.8349 2997.4632 2999.5884 3030.3875 3034.5060 3056.6949 3066.8826 3091.8623 3103.4994 3130.1265 3131.6325 3138.6066 3150.7276 3166.6879 3170.2030 3240.8284 3581.2086
redmass: 3.6210 5.4227 6.1890 4.4913 5.5475 3.8277 2.6307 3.3968 3.8088 5.2969 2.8216 2.4437 2.6442 2.3408 1.9376 3.9486 1.1139 3.9254 4.0652 4.5450 4.2482 4.0397 2.9269 4.6223 2.6733 3.0948 2.5322 3.4329 4.7769 6.9153 4.1955 4.2640 4.5383 1.5768 1.9636 3.3533 1.3098 1.3311 1.6107 2.8078 1.8705 3.1470 2.6298 1.3591 1.3619 4.4138 8.8347 3.2768 2.6401 1.2430 3.3107 2.3072 2.4571 1.9532 1.2602 1.3670 1.3276 1.7434 1.3503 1.2860 1.2299 1.2327 1.5264 2.9787 1.6630 1.2306 1.6957 1.4880 1.3735 1.2723 1.3445 1.2408 3.8108 1.7730 1.7344 3.5530 1.2069 1.3527 1.2153 1.0500 1.0959 1.0783 1.0946 1.1426 2.5279 3.3370 6.7698 6.1527 5.6181 1.0685 1.0552 1.0327 1.0657 1.1011 1.0623 1.0945 1.1043 1.1022 1.1036 1.0894 1.0934 1.0959 1.0885 1.0894 1.0942 1.0962 1.0670 1.0668
irintensity: 1.2177 0.5192 0.1730 4.3544 3.8129 1.3303 7.5100 5.8172 4.2084 4.1084 1.4987 1.9898 4.2382 3.6299 3.7646 4.4646 143.9627 5.5719 23.2950 22.4726 3.9456 3.7882 0.1986 6.2487 0.6337 11.4201 16.7144 8.0334 41.8977 4.8022 21.0732 5.6906 2.4651 71.5118 59.8873 11.8886 19.1058 10.1597 85.8791 2.3368 3.0538 6.2113 6.0570 2.2214 0.7996 115.6530 58.6487 6.4548 6.4088 34.3865 9.4819 74.8197 17.6951 101.4824 0.4560 16.6790 5.2076 8.2765 286.3906 5.7297 22.4041 45.7830 2.5368 305.6652 37.1153 9.4646 3.2239 9.9125 37.1540 6.1527 24.9737 26.3071 3.8394 116.8226 141.8795 71.8940 21.9388 243.0774 53.5823 15.4511 5.1480 50.0295 19.8533 20.9154 187.4509 117.9928 44.9982 270.2983 152.5418 83.6407 52.4941 86.8267 14.6548 62.3655 27.0445 106.2921 43.7939 31.8349 25.9653 0.2401 26.7154 5.3835 8.5050 19.6381 16.8630 8.5197 499.3848 6.1291
temp: 298.150 k
press: 1.00000 atm
elementType: 8 8 8 8 7 6 6 6 6 6 6 6 6 6 6 6 6 6 6 1 1 1 1 1 1 1 1 1 1 1 1 1 1 1 1 1 1 1
symmnumber: 1
zpe: 813046.1 jmol-1
zpe.correction: 0.309673 hartree
zpe.thermalcorrener: 0.329587 hartree
zpe.thermalcorrenthalpy: 0.330531 hartree
zpe.thermalcorrgfe: 0.258796 hartree
zpe.sumelectzpe: -899.052305 hartree
zpe.sumelectthermal: -899.032392 hartree
zpe.sumelectthermalent: -899.031447 hartree
zpe.sumelectthermalfe: -899.103182 hartree
dipole: -4.6498 4.6432 -1.4803
dipole: 6.7358
quadrupole: -91.4250 -119.8632 -115.7656
quadrupole: 34.4043 -2.8228 -5.9719
quadrupole: 17.5929 -10.8453 -6.7477 34.4043 -2.8228 -5.9719
hfenergy: -899.3619782 hartree
pointgroup: C01 [X(C14H19N1O4)]
dipole: -1.8153046 1.8201752 -0.6438106 debye
polarizability: 357.1392247|1.2096761|175.7785446|2.2303646|7.259781|97.269931 unknown
InChI: InChI=1S/C14H19NO4/c1-19-13-5-2-12(3-6-13)4-7-14(18)15(8-10-16)9-11-17/h2-7,16-17H,8-11H2,1H3
charge 0 multiplicity 1
38 atoms
O  3.057841 3.882193 -0.044403
O  4.712844 -2.838568 0.328698
O  2.288155 -1.909973 -0.396512
O  -5.813408 0.683327 0.144893
N  3.261843 0.151767 0.049185
C  3.199223 1.556734 0.502675
C  4.607118 -0.407809 -0.2689
C  2.143235 -0.659233 -0.120653
C  3.092201 2.552447 -0.667543
C  5.124415 -1.497798 0.709873
C  0.793525 -0.056147 0.004954
C  -1.721002 -0.441684 -0.038685
C  -0.317309 -0.851196 -0.108642
C  -2.143325 0.906864 0.181371
C  -2.731938 -1.430043 -0.197675
C  -4.491494 0.235612 0.072372
C  -3.501053 1.243111 0.23635
C  -4.103545 -1.110467 -0.145644
C  -6.8818 -0.310158 -0.011859
H  2.351401 1.710026 1.189904
H  4.113125 1.786886 1.078347
H  4.58829 -0.853278 -1.282361
H  5.306097 0.447702 -0.280073
H  2.169062 2.354046 -1.251778
H  3.966683 2.443009 -1.343866
H  6.230088 -1.503082 0.685662
H  4.801258 -1.238125 1.743435
H  0.698355 1.02141 0.169139
H  -0.120044 -1.919635 -0.279923
H  -1.398729 1.699494 0.312736
H  -2.432488 -2.471459 -0.366657
H  -3.829859 2.272864 0.405734
H  -4.847682 -1.901736 -0.27361
H  3.026091 4.581604 -0.743382
H  3.753007 -2.761713 0.028356
H  -6.832486 -1.079223 0.78264
H  -7.817338 0.260022 0.079662
H  -6.834359 -0.795392 -1.00562
