program: Gaussian 09
title: 000000626
version: EM64L-G09RevD.01
frameworkgroup: C1[X(C6H12O6)]
method: RPBEPBE
basis: SDD
operation: Freq
keyword: #pfreq=noraman
keyword: PBEPBE/SDD
title: #p freq=noraman PBEPBE/SDD
converged: YES YES NO NO
title: Mulliken charges:
elementType: O O O O O O C C C C C C H H H H H H H H H H H H
charge: -0.466150 -0.450806 -0.452921 -0.428638 -0.445128 -0.209620 -0.173777 -0.077125 -0.184051 -0.477315 -0.339835 0.219590 0.293562 0.209572 0.243343 0.231613 0.266040 0.251550 0.187837 0.354631 0.363065 0.349607 0.349893 0.385063
chargesum: 0.00000
title: Mulliken charges with hydrogens summed into heavy atoms:
elementType: O O O O O O C C C C C C
charge: -0.111519 -0.087740 -0.103313 -0.078745 -0.060065 -0.209620 0.119785 0.132447 0.059292 0.020338 0.099551 0.219590
polarizability: 1.01906812e+02 2.71282222e+00 8.23745999e+01 -2.92435731e-01 1.07142816e+00 7.30675235e+01
1716.lowfreq: -20.2702 -9.9499 -5.9027 -0.0005 0.0004 0.0007 21.7578 47.9525 51.6269
frequency: 21.0099 47.8235 51.4828 98.4611 101.0870 141.5256 164.9111 190.4757 235.6379 293.4704 306.7006 318.1044 336.4036 380.8937 454.6376 459.0170 484.4905 494.7132 534.5822 539.7738 619.6616 651.5508 659.8755 718.7471 787.7587 826.1555 869.8778 917.4017 942.3883 986.4866 998.5011 1019.5612 1060.6366 1064.0223 1080.7309 1106.8562 1150.0188 1188.6984 1202.4460 1215.1454 1251.9450 1266.7144 1305.5823 1310.2199 1323.9261 1327.0721 1350.5096 1371.2735 1379.7240 1383.4637 1387.8784 1437.3638 1467.6107 1685.9713 2905.0042 2923.2154 3018.2867 3040.3724 3085.6201 3088.8835 3103.1136 3482.5424 3488.7709 3507.8465 3512.4969 3526.5775
redmass: 5.2758 9.8191 6.4579 3.6435 5.8106 4.9846 4.4241 4.0729 1.1627 5.6502 4.6595 3.4532 6.6310 2.3527 2.0744 1.6812 2.8656 2.5769 2.9701 1.2285 1.7472 1.5904 1.3454 4.1190 4.6911 3.2471 2.6734 3.7688 3.0586 3.7840 2.1582 2.6807 4.3647 2.7000 2.9968 2.3357 1.1072 1.1408 1.2219 1.2096 1.4154 1.3919 1.4142 1.3689 1.2274 1.4649 1.3968 1.2697 1.2176 1.2295 1.4545 1.0850 1.0878 8.6011 1.0829 1.0712 1.0642 1.0851 1.0865 1.0915 1.0977 1.0647 1.0645 1.0653 1.0639 1.0654
irintensity: 3.2997 4.4889 0.5923 23.3040 16.7935 26.5757 21.4195 1.7077 168.4753 20.1992 1.1261 4.0408 5.0274 5.9661 59.6662 97.6006 2.2038 0.9827 6.2388 247.2228 95.3764 71.1791 47.5000 4.3954 14.2303 61.2568 4.4081 121.5156 37.4947 47.2660 50.6450 86.4351 28.6709 8.5772 71.4281 114.9372 70.9152 15.4628 35.4524 25.1863 33.4536 37.8102 19.5467 13.5364 13.7135 16.6967 12.6367 40.5033 37.0870 7.7300 32.7600 24.6617 4.4861 275.8929 65.6431 54.9657 8.8093 20.4977 6.2732 12.7631 4.6682 32.6402 14.8061 9.5104 24.3705 8.8850
temp: 298.150 k
press: 1.00000 atm
elementType: 8 8 8 8 8 8 6 6 6 6 6 6 1 1 1 1 1 1 1 1 1 1 1 1
symmnumber: 1
zpe: 494378.9 jmol-1
zpe.correction: 0.188299 hartree
zpe.thermalcorrener: 0.202090 hartree
zpe.thermalcorrenthalpy: 0.203034 hartree
zpe.thermalcorrgfe: 0.146510 hartree
zpe.sumelectzpe: -686.170064 hartree
zpe.sumelectthermal: -686.156273 hartree
zpe.sumelectthermalent: -686.155329 hartree
zpe.sumelectthermalfe: -686.211853 hartree
dipole: 2.9360 0.9082 -0.7833
dipole: 3.1715
quadrupole: -86.5334 -75.7427 -66.5386
quadrupole: 8.7731 -1.2792 4.5746
quadrupole: -10.2619 0.5289 9.7330 8.7731 -1.2792 4.5746
hfenergy: -686.3583627 hartree
pointgroup: C01 [X(C6H12O6)]
dipole: -1.150334 0.4656406 0.1298209 debye
dipolederiv: -0.7447402 0.0344595 0.1380983 0.0577266 -0.7723624 -0.0818 0.1336844 -0.1099138 -0.2351773 -0.5871686 -0.2691157 -0.0700533 -0.2511141 -0.6332397 -0.0321513 -0.0220871 -0.041962 -0.5448001 -0.825031 0.0186979 -0.0877789 0.0034289 -0.6930648 0.0867653 -0.0774002 0.0728949 -0.1527159 -0.6832239 -0.336889 -0.0337575 -0.336215 -0.4175917 -0.0730318 -0.0389149 -0.0675258 -0.5693096 -0.7473898 -0.0997979 0.3406675 -0.17297 -0.4615309 0.13925 0.4827244 0.1197478 -0.7285718 -1.0515341 0.1383028 0.1009449 0.2064755 -0.387718 0.0699902 -0.1532598 0.1562474 -0.4850025 0.2546456 -0.1581447 -0.0736028 -0.1503999 0.35033 0.0146157 -0.029506 0.0379741 0.1373713 0.4552197 0.1224147 0.1356652 0.0414699 0.5127009 0.0545351 0.0621347 0.0421822 0.3881822 0.4221174 -0.1778437 -0.0078208 -0.1660441 0.3132288 -0.0617188 0.0276957 0.0118577 0.1697744 -0.1044232 0.1768989 -0.0776445 0.1084993 -0.0738085 0.0777946 -0.061221 0.0850325 -0.0873519 0.4522614 0.1765149 0.1078211 0.2073486 0.2554208 0.1564463 0.0492132 0.1640975 0.4066951 1.560906 -0.1356162 -0.2517225 -0.1282741 0.4415584 -0.3688563 -0.1688493 -0.4499269 1.002358 0.0793969 -0.0009337 0.0050447 -0.0199068 0.054544 0.0130297 -0.0112162 0.0447025 -0.0391043 -0.0625911 0.0181804 -0.119262 0.047802 -0.0439728 0.0832748 -0.0870024 0.032931 -0.1702079 0.0433215 0.0364472 0.0498713 0.029731 0.0261821 -0.0098322 0.0720917 -0.0349455 -0.0856602 0.043427 -0.0955105 -0.0831544 -0.0784612 0.0022048 -0.0210107 -0.0719456 -0.0056667 0.0676036 -0.0232879 0.0243813 0.08642 0.0178007 0.0825087 0.0299897 0.0406677 0.0299216 0.0229648 -0.0055869 0.0467222 -0.0358945 0.1129324 0.0111818 0.0153362 -0.0116118 -0.023551 0.0718297 -0.0077741 -0.0191287 0.0595102 -0.0172558 -0.0221435 -0.1366143 0.0248626 -0.0879693 -0.1730343 0.3588567 0.0816082 -0.057288 0.0571873 0.3603822 -0.0015789 -0.0722786 0.0466198 0.0942931 0.3314809 0.1558117 0.0242256 0.1264743 0.2497301 -0.0496571 -0.0113254 -0.0390393 0.3168088 0.3765281 0.0339996 0.0045138 0.0586582 0.3179728 -0.0184281 0.0459634 -0.0515082 0.0285225 0.2912791 0.1422125 -0.0494 0.1911766 0.1903326 0.0473319 -0.0534319 0.0031698 0.316457 0.1733106 0.0863282 -0.1054035 0.0539297 0.3371545 0.0663201 -0.0689877 0.06463 0.2480752 unknown
polarizability: 101.0597362|-3.7821976|82.5153458|3.2540983|-2.4899225|73.7738534 unknown
InChI: InChI=1S/C6H12O6/c7-2-4(9)6(12)3(8)1-5(10)11/h3-4,6-10,12H,1-2H2
charge 0 multiplicity 1
24 atoms
O  -0.892212 2.318802 0.488055
O  1.769818 1.849281 0.02163
O  -2.827116 1.01318 -0.742895
O  -3.098016 -1.86131 -0.476404
O  1.232756 -1.316219 1.309314
O  3.390747 -1.238437 0.462785
C  -0.49403 0.918096 0.20497
C  0.802435 0.978033 -0.642585
C  -1.648254 0.137254 -0.503631
C  1.525978 -0.360732 -0.903684
C  -2.093069 -1.1102 0.272801
C  2.181169 -0.982794 0.317224
H  -0.266588 0.495426 1.195717
H  0.521652 1.401308 -1.636957
H  -1.363798 -0.15847 -1.529538
H  0.822151 -1.09168 -1.344674
H  2.332988 -0.180186 -1.631355
H  -1.24517 -1.79701 0.427328
H  -2.476408 -0.80219 1.273586
H  -1.399828 2.649897 -0.302694
H  1.250134 2.61518 0.389801
H  -3.151683 1.337018 0.140301
H  -3.765688 -1.208341 -0.815116
H  1.708732 -1.723805 2.08322
