program: Gaussian 09
title: 000035422
version: EM64L-G09RevD.01
frameworkgroup: C1[X(C12H15NO3)]
method: RPBEPBE
basis: SDD
operation: Freq
keyword: #p
keyword: freq=noraman
keyword: PBEPBE/SDD
title: #p freq=noraman PBEPBE/SDD
converged: YES YES NO NO
title: Mulliken charges:
elementType: O O O N C C C C C C C C C C C C H H H H H H H H H H H H H H H
charge: -0.258856 -0.450000 -0.287802 -0.414990 0.497028 -0.361798 -0.355047 -0.396815 -0.245735 0.324676 -0.314212 -0.360838 -0.365587 -0.397458 0.243292 -0.536793 0.221106 0.236842 0.226458 0.236498 0.267474 0.299519 0.219568 0.235742 0.252406 0.244047 0.205249 0.337296 0.225049 0.225042 0.248640
chargesum: 0.00000
title: Mulliken charges with hydrogens summed into heavy atoms:
elementType: O O O N C C C C C C C C C C C C
charge: -0.258856 -0.112704 -0.287802 -0.115471 0.497028 0.096149 -0.128588 -0.160317 0.021739 0.324676 0.141098 -0.108432 -0.121540 -0.192210 0.243292 0.161938
polarizability: 3.18184512e+02 6.92830894e-01 1.33975980e+02 1.59162220e+01 9.80734529e+00 8.11457115e+01
1716.lowfreq: -5.3254 -4.0259 -0.0008 -0.0003 -0.0001 5.1908 23.7330 31.5229 51.4852
frequency: 23.0659 31.4865 51.4732 60.1845 72.8350 106.7980 118.5100 160.2203 193.4067 193.6786 206.7823 244.7853 249.4448 283.1857 308.5942 359.3498 375.2644 418.9822 431.4636 472.3027 507.3896 524.4184 533.1647 544.1962 632.9060 682.2614 692.5285 741.7182 747.1055 813.7465 821.5973 834.2018 856.2239 867.5773 869.1830 945.8116 953.5539 966.1376 984.7468 999.5402 1001.9896 1007.4096 1074.6855 1084.8409 1111.8380 1113.9416 1157.4586 1172.5974 1180.5012 1194.4292 1216.3630 1242.6097 1265.4323 1293.2722 1316.3078 1323.6521 1329.2910 1352.5304 1370.9192 1381.5414 1424.9807 1432.6807 1436.2126 1467.3877 1469.0331 1472.4657 1473.1523 1504.0519 1570.9120 1577.8966 1621.2100 1650.3106 2964.5226 2999.6049 3006.3550 3054.7951 3076.5134 3090.4676 3093.6688 3104.1186 3128.6370 3130.5636 3138.4859 3165.7419 3169.5235 3556.2926 3558.8959
redmass: 4.6022 4.9496 4.9706 4.3268 4.9591 3.6608 3.3387 3.2174 2.3493 2.9197 4.1844 1.4183 3.6642 2.9672 1.4116 2.5972 3.7934 2.8926 4.8124 3.2899 1.9724 2.2040 1.8437 3.1509 6.9769 4.0602 4.4940 3.9809 4.6295 1.3127 3.4474 1.6310 3.4303 2.2880 2.0180 1.3658 2.7498 1.3623 8.8253 2.7645 2.8139 1.2301 2.0558 3.1294 1.2640 1.3773 1.3288 1.2679 1.3167 1.6637 1.7017 3.0257 1.2271 1.7342 1.5453 1.4870 1.1949 1.3169 1.2364 3.8565 1.1815 3.6323 1.1912 1.0508 1.1012 1.2047 1.4933 2.5246 6.8853 6.6546 6.2308 5.6077 1.0327 1.0631 1.0602 1.1041 1.1018 1.1039 1.0914 1.0884 1.0910 1.0983 1.0881 1.0940 1.0962 1.0661 1.0778
irintensity: 0.8330 0.2111 6.1478 2.6894 5.6395 6.2911 10.2308 0.6954 0.4922 1.2219 1.0535 0.0359 33.2806 23.7572 153.8972 58.9627 2.8040 0.1521 1.4253 3.4217 34.6187 5.6506 27.3212 38.0033 2.8560 0.9571 3.3054 0.8523 7.0845 17.1956 10.1876 88.3675 22.7940 8.5904 9.8596 2.6912 17.1929 0.6309 59.9755 37.6944 40.4492 54.1471 2.9197 41.5989 0.6009 12.3142 4.3325 26.7309 265.8028 111.4447 15.8074 282.1753 14.2291 5.0281 37.7678 0.8516 31.7006 8.3334 24.1380 8.4901 46.6898 42.0929 8.0689 16.0063 13.2396 221.2951 106.7895 204.4525 52.6969 260.5627 140.6941 133.7461 83.0290 30.5401 40.4414 44.8842 15.4922 54.4443 0.4890 17.1801 23.7709 10.8289 8.7373 16.9380 6.9429 1.4090 27.4108
temp: 298.150 k
press: 1.00000 atm
elementType: 8 8 8 7 6 6 6 6 6 6 6 6 6 6 6 6 1 1 1 1 1 1 1 1 1 1 1 1 1 1 1
symmnumber: 1
zpe: 654416.6 jmol-1
zpe.correction: 0.249254 hartree
zpe.thermalcorrener: 0.265776 hartree
zpe.thermalcorrenthalpy: 0.266721 hartree
zpe.thermalcorrgfe: 0.203100 hartree
zpe.sumelectzpe: -745.481359 hartree
zpe.sumelectthermal: -745.464836 hartree
zpe.sumelectthermalent: -745.463892 hartree
zpe.sumelectthermalfe: -745.527513 hartree
dipole: 4.6610 -1.1644 -0.9796
dipole: 4.9031
quadrupole: -85.7158 -93.7181 -98.2486
quadrupole: 11.1074 13.5997 5.1206
quadrupole: 6.8450 -1.1572 -5.6878 11.1074 13.5997 5.1206
hfenergy: -745.7306129 hartree
pointgroup: C01 [X(C12H15N1O3)]
dipole: 1.8384529 -0.3435855 -0.4723969 debye
polarizability: 318.2072275|-0.284954|127.5580134|15.5618114|20.0093092|87.5409632 unknown
InChI: InChI=1S/C12H15NO3/c1-16-11-5-2-10(3-6-11)4-7-12(15)13-8-9-14/h2-7,13-14H,8-9H2,1H3
charge 0 multiplicity 1
31 atoms
O  5.332194 -0.772641 -0.040647
O  -5.793719 -1.545509 1.10691
O  -2.929485 1.579206 0.259092
N  -3.674235 -0.406198 -0.696811
C  1.208475 0.248383 0.034258
C  -5.083787 0.024421 -0.699672
C  1.68832 -0.992824 -0.488265
C  2.170711 1.164526 0.541938
C  -0.208536 0.617261 0.072257
C  3.99593 -0.364515 0.017165
C  -5.75067 -0.138314 0.681495
C  3.054859 -1.297484 -0.498525
C  3.550431 0.87544 0.540246
C  -1.282942 -0.116812 -0.351762
C  -2.659959 0.433102 -0.230661
C  6.349619 0.14506 0.482549
H  -5.627715 -0.58329 -1.444259
H  -5.13002 1.08938 -0.995808
H  0.980861 -1.725924 -0.890822
H  1.826608 2.123749 0.947431
H  -0.452556 1.604725 0.492712
H  -3.425932 -1.291162 -1.140568
H  -6.805753 0.17666 0.623745
H  -5.224359 0.493692 1.422859
H  3.427707 -2.245847 -0.897147
H  4.256535 1.608297 0.941177
H  -1.161628 -1.117432 -0.788851
H  -4.862688 -1.841735 1.273161
H  6.189065 0.349174 1.558679
H  6.357718 1.097894 -0.081026
H  7.306252 -0.378285 0.341751
