program: Gaussian 09
title: 000035483
version: EM64L-G09RevD.01
frameworkgroup: C1[X(C8H10Cl3N5O)]
method: RPBEPBE
basis: SDD
operation: Freq
keyword: #p
keyword: freq=noraman
keyword: PBEPBE/SDD
title: #p freq=noraman PBEPBE/SDD
converged: YES YES NO NO
title: Mulliken charges:
elementType: Cl Cl Cl O N N N N N C C C C C C C C H H H H H H H H H H
charge: 0.090320 0.147142 0.108177 -0.228328 -0.139744 -0.436703 0.023891 -0.084796 0.018299 0.043847 0.265137 0.293801 0.084198 -0.607707 -0.635474 -0.768723 -0.744991 0.350815 0.225165 0.233596 0.284341 0.241882 0.234298 0.255386 0.251253 0.245793 0.249127
chargesum: 0.00000
title: Mulliken charges with hydrogens summed into heavy atoms:
elementType: Cl Cl Cl O N N N N N C C C C C C C C
charge: 0.090320 0.147142 0.108177 -0.228328 -0.139744 -0.085888 0.023891 -0.084796 0.018299 0.043847 0.265137 0.293801 0.084198 0.135395 0.096092 -0.768723 0.001181
polarizability: 2.13585954e+02 2.01285910e+01 1.61805007e+02 -8.08390330e+00 3.44868621e+00 1.13302155e+02
1716.lowfreq: -6.8676 -3.8264 -0.0027 -0.0025 -0.0012 6.1238 13.1339 24.4387 47.6223
frequency: 12.5165 24.3918 47.6192 58.4362 63.6005 86.7877 107.3466 116.4783 142.5070 144.5145 172.6372 186.3911 207.7647 216.7505 220.7290 244.6829 254.3124 289.9393 317.0463 322.3913 363.6128 381.9747 429.4239 474.6253 554.8952 588.2378 597.6526 614.5434 637.3435 662.4404 703.4232 750.9036 752.6432 763.4510 827.5626 847.3766 905.1362 950.3158 977.0050 1010.2938 1051.6189 1057.8152 1070.6054 1095.6715 1126.9777 1143.3587 1189.5293 1246.8899 1279.2412 1335.1076 1356.7945 1388.2340 1397.3167 1421.6921 1439.6529 1445.0051 1453.0033 1471.2211 1476.3428 1483.1742 1488.9774 1497.0950 1502.9144 1514.9336 1653.1035 2959.2070 2974.5297 3001.8256 3044.4018 3051.0043 3083.7666 3104.4463 3125.3634 3137.3210 3518.2405
redmass: 15.9503 4.4130 3.3911 3.6667 1.2134 7.1807 3.8655 1.5467 1.2829 3.4330 6.5234 4.2961 6.3928 14.2474 5.1735 3.9280 5.9944 15.5492 5.5785 6.0877 4.1081 11.3274 3.2441 5.3714 6.0767 3.1653 4.9656 1.8965 6.9610 4.2687 6.8916 8.2562 7.8894 10.2273 8.4273 6.2897 13.5998 4.9626 2.5598 3.7176 1.6541 1.3964 2.5016 1.2268 2.2277 1.4606 7.8354 5.9114 4.3173 4.1590 3.1768 2.5896 1.5919 1.1519 1.2704 1.2894 1.0487 1.0726 1.1177 3.5588 1.0672 1.4107 2.1811 3.5394 7.7831 1.0410 1.0364 1.0379 1.0954 1.1019 1.0963 1.0982 1.0975 1.1004 1.0758
irintensity: 0.0741 3.2398 0.7109 1.9613 0.1871 0.3065 1.2468 0.4081 0.0989 0.7381 0.4483 0.7850 0.6130 0.1622 0.0865 11.3524 0.7312 0.2370 2.1545 2.0307 18.1709 0.9123 9.5805 1.8945 13.5061 0.0923 67.7969 115.3056 25.1979 24.2864 11.8690 77.0071 60.4276 126.6136 3.5672 3.4837 20.9127 8.5377 11.0799 8.6255 7.7957 20.3580 63.7668 1.1826 302.9327 48.4614 70.2399 38.4624 1.2116 64.8186 296.9243 159.2979 74.7504 28.9799 107.4004 8.8361 17.4495 21.6267 121.4340 223.8043 22.6316 213.6711 42.2101 563.8530 435.4104 57.0478 83.1232 1.8968 38.3308 23.6923 6.0755 16.2585 1.2152 10.1823 43.1730
temp: 298.150 k
press: 1.00000 atm
elementType: 17 17 17 8 7 7 7 7 7 6 6 6 6 6 6 6 6 1 1 1 1 1 1 1 1 1 1
symmnumber: 1
zpe: 488172.6 jmol-1
zpe.correction: 0.185935 hartree
zpe.thermalcorrener: 0.204660 hartree
zpe.thermalcorrenthalpy: 0.205605 hartree
zpe.thermalcorrgfe: 0.135445 hartree
zpe.sumelectzpe: -2038.730309 hartree
zpe.sumelectthermal: -2038.711583 hartree
zpe.sumelectthermalent: -2038.710639 hartree
zpe.sumelectthermalfe: -2038.780799 hartree
dipole: -6.2933 3.7254 2.2708
dipole: 7.6577
quadrupole: -96.7730 -114.8784 -120.7532
quadrupole: 1.4524 -8.5865 -2.0110
quadrupole: 14.0285 -4.0769 -9.9517 1.4524 -8.5865 -2.0110
hfenergy: -2038.9162438 hartree
pointgroup: C01[X(C8H10Cl3N5O1)]
dipole: -2.3335907 1.8466777 0.4699728 debye
polarizability: 218.3849287|12.517405|158.2029931|-0.5318426|-0.4057633|112.1051937 unknown
InChI: InChI=1S/C8H10Cl3N5O/c1-4-12-5(8(9,10)11)14-6(13-4)15-7(17)16(2)3/h15H,1-3H3
charge 0 multiplicity 1
27 atoms
Cl 3.267479 -1.088949 2.194757
Cl 1.463654 -2.922248 0.612861
Cl 3.793002 -1.588208 -0.753535
O  -2.176145 -1.308133 -1.261299
N  -3.874354 -0.219044 -0.067374
N  -1.776459 0.840157 -0.330357
N  0.272831 -0.294276 0.095917
N  0.185015 2.094512 -0.390781
N  2.310381 1.018979 0.023574
C  -0.400465 0.859329 -0.217533
C  -2.589097 -0.33036 -0.58661
C  1.614493 -0.141157 0.184701
C  1.542554 2.126005 -0.250565
C  -4.86851 -1.2402 -0.440124
C  -4.304777 0.809385 0.893761
C  2.457554 -1.378283 0.529478
C  2.252133 3.43913 -0.414329
H  -2.190385 1.768916 -0.454723
H  -5.773329 -0.762111 -0.860278
H  -5.159904 -1.841772 0.441937
H  -4.421459 -1.909023 -1.190352
H  -4.964907 0.345828 1.649111
H  -4.87142 1.62813 0.405109
H  -3.437486 1.234264 1.423065
H  2.964568 3.379317 -1.256605
H  1.529901 4.247451 -0.597797
H  2.848531 3.662561 0.487792
