program: Gaussian 09
title: 000035411
version: EM64L-G09RevD.01
frameworkgroup: C1[X(C9H18)]
method: RPBEPBE
basis: SDD
operation: Freq
keyword: #p
keyword: freq=noraman
keyword: PBEPBE/SDD
title: #p freq=noraman PBEPBE/SDD
converged: YES YES NO NO
title: Mulliken charges:
elementType: C C C C C C C C C H H H H H H H H H H H H H H H H H H
charge: 0.443559 -0.448049 -0.473551 -0.418412 -0.416259 -0.382414 -0.411660 -0.794905 -0.738685 0.188575 0.194055 0.201848 0.188819 0.194310 0.198526 0.200932 0.193908 0.200774 0.184134 0.195506 0.195556 0.209606 0.217608 0.217188 0.222348 0.224060 0.212627
chargesum: 0.00000
title: Mulliken charges with hydrogens summed into heavy atoms:
elementType: C C C C C C C C C
charge: 0.443559 -0.065420 -0.082884 -0.025576 -0.021419 0.002494 -0.020599 -0.150504 -0.079651
polarizability: 1.05383092e+02 -2.58387352e-01 8.97047670e+01 -1.50668052e-01 8.77125537e-02 8.51157786e+01
1716.lowfreq: -36.6139 -2.0998 -0.0005 -0.0004 0.0004 18.1145 90.5631 138.8239 184.9099
frequency: 90.2150 138.7912 184.8635 200.1976 237.5076 277.5486 306.1779 328.2331 345.1341 399.5469 409.3815 447.0152 475.8062 547.1905 682.0183 770.0843 778.6142 821.2065 841.0802 871.7237 880.3910 922.9607 959.4129 971.6002 979.6559 1014.2208 1047.1927 1056.0029 1066.3460 1092.7155 1104.3900 1143.8027 1160.5399 1189.4719 1227.4783 1256.9250 1257.9613 1272.8911 1313.8624 1319.8683 1330.4139 1335.4273 1341.8340 1345.0651 1354.4739 1386.6881 1393.2744 1453.1257 1456.1396 1461.5949 1465.8421 1467.1662 1478.5709 1481.8686 1486.5740 1488.8118 1498.7635 2945.2820 2949.4788 2953.8275 2960.8613 2971.0115 2972.4664 2975.9226 2981.3442 3000.2532 3008.2353 3017.9867 3022.2466 3026.5318 3038.7636 3062.9254 3069.4148 3076.0709 3079.8473
redmass: 2.0565 2.1265 1.2346 2.3743 1.3695 1.3391 2.7111 1.9740 2.0602 2.3154 1.8130 3.0970 2.2660 1.7615 2.9654 1.2617 1.3895 2.3122 1.7087 2.0932 1.8379 1.4572 1.8060 1.6195 1.8059 1.6651 1.6516 2.0036 1.6361 1.3551 1.5861 1.4777 1.9325 2.2991 1.8802 1.2580 1.3881 1.3111 1.4868 1.4863 1.4886 1.4159 1.4430 1.3967 1.4803 1.2307 1.2036 1.0812 1.0801 1.0777 1.0738 1.0822 1.0815 1.0546 1.0745 1.0555 1.0549 1.0600 1.0611 1.0600 1.0621 1.0586 1.0617 1.0434 1.0365 1.1005 1.0980 1.0979 1.0943 1.1029 1.1032 1.0985 1.0981 1.0985 1.0987
irintensity: 0.0067 0.0125 0.0451 0.0409 0.0102 0.0062 0.0215 0.1549 0.1954 0.1695 0.1486 0.0368 1.0360 1.8288 0.8513 3.9795 2.1033 0.2020 6.4673 5.0814 3.9841 1.1227 2.4751 7.0852 4.1331 10.4800 0.7551 0.8935 6.0042 0.8349 0.5424 3.1101 3.7608 0.8439 1.0037 0.5664 0.4567 1.0122 0.5007 0.7301 0.3387 0.0994 1.3667 1.2130 1.2146 15.9002 22.4568 0.9917 1.6726 2.2188 10.6849 20.0476 2.6824 10.4364 2.3896 25.0494 5.5761 3.1970 37.5062 85.0399 34.3951 18.7625 41.0889 20.9161 31.8488 3.2673 83.5215 57.5731 61.0506 15.3581 129.4036 28.7420 75.3401 42.0553 45.3144
temp: 298.150 k
press: 1.00000 atm
elementType: 6 6 6 6 6 6 6 6 6 1 1 1 1 1 1 1 1 1 1 1 1 1 1 1 1 1 1
symmnumber: 1
zpe: 656320.0 jmol-1
zpe.correction: 0.249979 hartree
zpe.thermalcorrener: 0.259951 hartree
zpe.thermalcorrenthalpy: 0.260895 hartree
zpe.thermalcorrgfe: 0.215990 hartree
zpe.sumelectzpe: -353.005019 hartree
zpe.sumelectthermal: -352.995047 hartree
zpe.sumelectthermalent: -352.994103 hartree
zpe.sumelectthermalfe: -353.039008 hartree
dipole: 0.0421 -0.0237 -0.0760
dipole: 0.0900
quadrupole: -59.7551 -59.2794 -58.9642
quadrupole: 0.2178 0.0441 -0.1109
quadrupole: -0.4222 0.0535 0.3687 0.2178 0.0441 -0.1109
hfenergy: -353.2549981 hartree
pointgroup: C01 [X(C9H18)]
dipole: -0.0166068 -0.0096103 0.0297696 debye
polarizability: 105.3774328|0.413914|89.7120244|-0.0492314|-0.0689624|85.1141802 unknown
InChI: InChI=1S/C9H18/c1-3-9(2)7-5-4-6-8-9/h3-8H2,1-2H3
charge 0 multiplicity 1
27 atoms
C  0.543878 -0.215229 -0.091091
C  -0.46119 -1.281385 0.453238
C  -0.016645 1.207361 0.225881
C  -1.922221 -1.072353 -0.01195
C  -1.47387 1.423147 -0.250002
C  -2.421787 0.349966 0.333903
C  1.902528 -0.434583 0.649146
C  0.741879 -0.400247 -1.619673
C  3.066495 0.500646 0.251623
H  -0.438346 -1.245381 1.563669
H  -0.11111 -2.293418 0.163097
H  0.639684 1.976855 -0.226038
H  0.022078 1.360954 1.326055
H  -2.57381 -1.832775 0.461921
H  -2.001359 -1.231656 -1.106317
H  -1.518756 1.388651 -1.357453
H  -1.813898 2.435182 0.046121
H  -3.452816 0.49925 -0.042189
H  -2.462343 0.463157 1.437813
H  2.217838 -1.486882 0.485155
H  1.72017 -0.332828 1.73969
H  1.214164 -1.377848 -1.836137
H  -0.215956 -0.365128 -2.167669
H  1.389613 0.390993 -2.039764
H  3.332059 0.395046 -0.815815
H  2.821796 1.562284 0.437486
H  3.970924 0.26182 0.841599
