program: Gaussian 09
title: 000035397
version: EM64L-G09RevD.01
frameworkgroup: C1[X(C7H5Cl3)]
method: RPBEPBE
basis: SDD
operation: Freq
keyword: #pfreq=noraman
keyword: PBEPBE/SDD
title: #p freq=noraman PBEPBE/SDD
converged: NO NO NO NO
title: Mulliken charges:
elementType: Cl Cl Cl C C C C C C C H H H H H
charge: -0.005213 -0.005231 0.034365 0.506183 -0.396240 -0.396106 -0.043780 -0.043728 -0.794931 -0.092247 0.264417 0.264410 0.231511 0.231502 0.245088
chargesum: 0.00000
title: Mulliken charges with hydrogens summed into heavy atoms:
elementType: Cl Cl Cl C C C C C C C
charge: -0.005213 -0.005231 0.034365 0.506183 -0.131823 -0.131696 -0.043780 -0.043728 -0.086830 -0.092247
polarizability: 1.35176545e+02 -3.84791421e-04 1.26321591e+02 -4.04993950e-01 -2.65606652e-05 4.28673570e+01
1716.lowfreq: -4.1965 -0.0016 0.0005 0.0016 4.8200 7.9446 66.0474 74.3686 149.8310
frequency: 65.8410 74.3583 149.8272 188.5779 194.5362 195.6313 239.4291 306.3897 326.4064 416.7346 417.8035 500.2236 513.6157 552.5179 614.5967 695.4544 761.7364 859.2581 889.1166 890.6824 1005.0047 1006.3294 1047.9289 1146.2691 1196.8180 1231.5616 1349.5829 1376.4266 1400.8391 1426.5829 1468.3470 1474.3784 1556.7556 1588.5973 2979.2790 3062.4224 3088.7671 3152.1464 3154.8887
redmass: 1.0137 17.7855 4.8082 23.7972 5.3252 15.2817 3.7364 5.4672 23.3747 5.7917 8.8971 5.6195 5.2802 3.7283 6.1078 4.2227 10.2346 1.3792 7.2627 1.3578 1.3888 6.0550 1.5363 1.8301 1.6271 3.9812 7.4716 2.9299 1.2258 3.6965 1.1119 1.0542 6.3077 6.7232 1.0383 1.0959 1.1000 1.0922 1.0933
irintensity: 0.5240 0.1409 1.5266 0.0428 0.0040 0.0001 0.7474 0.2226 0.0165 2.2596 8.7611 2.3419 0.1017 7.5633 11.1732 5.4488 78.7829 30.8472 0.6693 0.0115 7.7661 8.8835 18.5259 29.1872 12.8980 10.0711 6.7277 28.3464 14.8317 45.7804 44.1622 14.2958 54.7262 23.9547 24.0169 17.0774 14.8746 0.9012 1.5194
temp: 298.150 k
press: 1.00000 atm
elementType: 17 17 17 6 6 6 6 6 6 6 1 1 1 1 1
symmnumber: 1
zpe: 254599.2 jmol-1
zpe.correction: 0.096972 hartree
zpe.thermalcorrener: 0.107002 hartree
zpe.thermalcorrenthalpy: 0.107946 hartree
zpe.thermalcorrgfe: 0.060087 hartree
zpe.sumelectzpe: -1649.197571 hartree
zpe.sumelectthermal: -1649.187541 hartree
zpe.sumelectthermalent: -1649.186597 hartree
zpe.sumelectthermalfe: -1649.234456 hartree
dipole: -3.8620 -0.0001 0.0614
dipole: 3.8625
quadrupole: -70.1143 -79.5172 -80.6061
quadrupole: 0.0006 -0.2147 0.0000
quadrupole: 6.6316 -2.7713 -3.8602 0.0006 -0.2147 0.0000
hfenergy: -1649.294543 hartree
pointgroup: C01 [X(C7H5Cl3)]
dipole: -1.5194991 -0.0003251 -0.0184654 debye
dipolederiv: -0.2032028 0.259791 0.0014492 0.2676283 -0.6164126 -0.0015458 0.0016239 0.0012275 -0.0317707 -0.2030485 -0.2596652 0.0014438 -0.267489 -0.6165723 0.0015344 0.0016216 -0.0012373 -0.0317833 -0.6676585 -0.0000927 0.0023476 -0.0000949 -0.0141784 0. 0.0039251 0. 0.0004445 0.4408052 0.0000669 0.0157544 0.0001163 0.1327579 0.0000019 0.0832342 0.0000099 -0.0161271 -0.2784766 -0.1367468 0.0032441 -0.1579818 -0.1972529 -0.0072649 -0.0056725 -0.0069069 -0.132609 -0.278571 0.1367425 0.0032508 0.1579536 -0.1971295 0.0072713 -0.0056724 0.0069158 -0.1326195 0.183627 -0.3938325 -0.000616 -0.3352297 0.9355215 -0.0033163 -0.0070939 -0.0022649 -0.0133475 0.183435 0.3936274 -0.0006107 0.3349782 0.9357401 0.003334 -0.0070927 0.0022719 -0.0133334 -0.1453049 -0.0000587 -0.0126026 -0.000199 0.0397256 0.0000013 -0.1219253 -0.0000253 0.0553295 0.8451675 0.0001665 -0.0086825 0.0002133 -0.4188415 -0.0000053 -0.0042326 0. -0.0593424 0.0451271 0.0620084 0.0035735 0.057809 0.0043283 0.0011908 0.0067269 -0.0024418 0.1611145 0.0451712 -0.0619928 0.0035699 -0.0578026 0.0042804 -0.0011942 0.0067257 0.0024423 0.1611076 0.0279171 -0.0244937 0.0191965 -0.0951536 -0.0539472 0.0967568 0.0709801 0.0747975 0.0682121 0.0279358 0.0245244 0.0191844 0.0953025 -0.0541057 -0.0966209 0.0708954 -0.0746651 0.0683882 -0.0229235 -0.0000447 -0.0505026 -0.0000506 0.1160861 -0.0001428 -0.0940433 -0.0001237 -0.0836636 unknown
polarizability: 135.1782845|0.0025574|126.3215917|0.0583059|0.0010043|42.865617 unknown
InChI: InChI=1S/C7H5Cl3/c1-4-2-5(8)7(10)6(9)3-4/h2-3H,1H3
charge 0 multiplicity 1
15 atoms
Cl 1.244439 -2.800293 -0.003813
Cl 1.243605 2.800704 -0.003751
Cl 2.91042 0.000435 -0.018048
C  -1.751655 -0.000254 0.016442
C  -1.028424 1.217658 0.013246
C  -1.028051 -1.217945 0.013202
C  0.381245 -1.214775 -0.001222
C  0.380879 1.214896 -0.001186
C  -3.269672 -0.000507 -0.002652
C  1.108089 0.000177 -0.007338
H  -1.55819 2.175858 0.020152
H  -1.557533 -2.176307 0.020086
H  -3.678996 -0.893882 0.500847
H  -3.679287 0.893286 0.499864
H  -3.652669 -0.001151 -1.041429
