program: Gaussian 09
title: 000035485
version: EM64L-G09RevD.01
frameworkgroup: C1[X(C12H9Cl4N5O)]
method: RPBEPBE
basis: SDD
operation: Freq
keyword: #p
keyword: freq=noraman
keyword: PBEPBE/SDD
title: #p freq=noraman PBEPBE/SDD
converged: YES YES NO NO
title: Mulliken charges:
elementType: Cl Cl Cl Cl O N N N N N C C C C C C C C C C C C H H H H H H H H H
charge: -0.070929 0.094907 0.150632 0.111280 -0.196470 -0.471434 -0.451473 0.026067 -0.084154 0.023113 0.606535 0.043121 0.299154 0.083773 0.245050 -0.356429 -0.307891 -0.217631 -0.222840 -0.773148 -0.238816 -0.743609 0.312523 0.343262 0.310168 0.257821 0.236867 0.239124 0.247873 0.251219 0.252336
chargesum: 0.00000
title: Mulliken charges with hydrogens summed into heavy atoms:
elementType: Cl Cl Cl Cl O N N N N N C C C C C C C C C C C C
charge: -0.070929 0.094907 0.150632 0.111280 -0.196470 -0.158910 -0.108211 0.026067 -0.084154 0.023113 0.606535 0.043121 0.299154 0.083773 0.245050 -0.356429 0.002277 0.040190 0.014028 -0.773148 0.000308 0.007818
polarizability: 3.23751872e+02 3.50945683e+01 2.18539281e+02 -1.04418649e+01 1.95786159e+01 1.30117968e+02
1716.lowfreq: -1.8657 -0.0028 -0.0021 -0.0013 2.1135 3.8566 13.6974 16.0492 25.7694
frequency: 13.6849 15.7774 25.7553 35.6735 54.7331 74.9017 79.3498 88.3652 111.9464 136.9027 159.3283 176.7002 190.1205 208.3142 215.0748 218.0921 225.3217 261.2305 281.0410 292.3363 313.3212 330.7866 369.0696 381.9364 416.3497 438.2311 473.6039 535.4448 541.3981 562.0605 588.9437 603.4395 637.3112 655.2532 660.8401 677.8023 688.9478 719.8306 735.3810 752.0565 761.5136 763.0177 801.7357 830.9914 845.9707 872.0795 906.1895 938.8848 950.8726 975.6484 994.8500 1004.4962 1015.3793 1039.4337 1051.4131 1079.7709 1127.7002 1148.0082 1173.9871 1200.9914 1244.8448 1278.8110 1306.8603 1338.8572 1368.0487 1385.8342 1397.2421 1427.9907 1442.3384 1452.5720 1457.2238 1484.8134 1487.3906 1505.2419 1527.4235 1579.7562 1615.1733 1672.9148 3002.6374 3083.8831 3139.3355 3145.5727 3162.3459 3179.7158 3194.0831 3474.9747 3513.0610
redmass: 12.0581 23.4926 7.2119 5.8857 1.0788 7.6697 8.9430 8.6003 8.5674 14.4953 5.7115 5.2652 4.7992 9.3648 12.5534 14.2817 11.2076 11.5533 5.0978 15.7157 6.7903 7.8305 8.9422 19.4490 7.6354 3.3679 5.3434 4.0089 5.8264 6.2066 2.6301 2.1561 4.8607 3.0117 1.5902 7.7573 5.9924 3.7987 6.9467 8.8423 1.5922 3.8056 6.7157 9.4092 5.8121 1.3500 13.5915 8.2775 1.3595 2.5495 1.3274 6.5697 5.2368 2.0670 1.6586 3.0414 1.6504 2.7883 1.0672 6.5191 1.6300 4.6539 1.9005 4.4995 5.6404 3.2508 1.4423 2.5219 1.4418 1.0466 2.3318 5.4888 2.7587 2.6197 3.2806 5.0328 6.5457 6.5174 1.0380 1.0962 1.1004 1.0868 1.0922 1.0979 1.0957 1.0765 1.0761
irintensity: 0.0292 0.0411 0.9430 0.3336 0.4604 5.2058 1.0928 0.3341 1.9018 0.3708 0.5212 0.1638 1.3752 1.8555 1.0007 0.8797 5.8005 0.8178 3.1768 0.0998 0.7798 5.0519 8.8156 0.1702 2.4848 10.7092 7.8979 9.5793 13.0620 16.7787 8.1923 145.9231 21.3526 31.4995 97.6135 12.3245 19.9351 2.7661 42.0474 103.9105 43.2041 199.6299 16.8978 0.7909 4.1289 4.2922 24.0640 41.6607 5.2604 5.6813 2.6832 49.6764 18.0225 4.6753 7.9656 8.0128 52.8787 269.9140 0.0609 177.5220 15.9813 4.4436 121.8838 179.6926 241.7774 115.6194 126.9235 208.7438 87.9062 18.7664 39.0106 542.3745 1275.8377 192.5553 10.8166 20.0086 69.4481 224.3788 1.2343 5.3040 9.4236 3.1800 10.5794 7.1009 11.4293 67.1415 49.6707
temp: 298.150 k
press: 1.00000 atm
elementType: 17 17 17 17 8 7 7 7 7 7 6 6 6 6 6 6 6 6 6 6 6 6 1 1 1 1 1 1 1 1 1
symmnumber: 1
zpe: 528142.5 jmol-1
zpe.correction: 0.201159 hartree
zpe.thermalcorrener: 0.222516 hartree
zpe.thermalcorrenthalpy: 0.223460 hartree
zpe.thermalcorrgfe: 0.145993 hartree
zpe.sumelectzpe: -2650.332156 hartree
zpe.sumelectthermal: -2650.310799 hartree
zpe.sumelectthermalent: -2650.309855 hartree
zpe.sumelectthermalfe: -2650.387322 hartree
dipole: -4.1820 3.4509 -0.2372
dipole: 5.4272
quadrupole: -143.8527 -143.9725 -156.3087
quadrupole: 14.7194 -1.4231 0.4966
quadrupole: 4.1919 4.0721 -8.2641 14.7194 -1.4231 0.4966
hfenergy: -2650.5333149 hartree
pointgroup: C01 [X(C12H9Cl4N5O1)]
dipole: 1.483976 -1.5327116 -0.0882451 debye
polarizability: 330.2672981|22.582595|211.7775859|7.1807708|-21.3213748|130.3642376 unknown
InChI: InChI=1S/C12H9Cl4N5O/c1-6-17-9(12(14,15)16)20-10(18-6)21-11(22)19-8-5-3-2-4-7(8)13/h2-5,19,21H,1H3
charge 0 multiplicity 1
31 atoms
Cl 4.406883 -2.211522 1.444701
Cl -4.800971 1.427869 2.205098
Cl -2.750198 3.007207 0.648971
Cl -5.213432 1.98532 -0.75074
O  0.760854 0.97197 -0.844723
N  2.208172 -0.584794 0.187694
N  -0.011651 -1.170824 -0.162399
N  -1.903815 0.238769 0.188028
N  -2.121332 -2.137605 -0.31117
N  -4.095452 -0.785764 0.030111
C  3.465342 0.057924 0.0681
C  -1.384641 -0.994361 -0.103279
C  -3.257556 0.269626 0.225619
C  -3.476174 -1.986198 -0.225028
C  0.981196 -0.13847 -0.309698
C  4.612698 -0.583654 0.609771
C  3.652562 1.318588 -0.563258
C  5.897477 -0.026769 0.537878
C  4.941399 1.884175 -0.645583
C  -3.936934 1.608009 0.552192
C  6.065575 1.223744 -0.100801
C  -4.34917 -3.190217 -0.426288
H  2.217728 -1.44708 0.743302
H  0.267427 -2.151203 -0.271101
H  2.779722 1.833665 -0.968353
H  6.74861 -0.559487 0.970822
H  5.062661 2.855233 -1.136486
H  7.062834 1.66971 -0.164009
H  -3.737088 -4.085611 -0.60489
H  -4.991969 -3.343484 0.458634
H  -5.027358 -3.024867 -1.282519
