program: Gaussian 09
title: 000035392
version: EM64L-G09RevD.01
frameworkgroup: C1[X(C5H6Cl2N4)]
method: RPBEPBE
basis: SDD
operation: Freq
keyword: #p
keyword: freq=noraman
keyword: PBEPBE/SDD
title: #p freq=noraman PBEPBE/SDD
converged: NO NO NO NO
title: Mulliken charges:
elementType: Cl Cl N N N N C C C C C H H H H H H
charge: 0.030889 0.030746 0.006832 -0.083898 -0.075602 -0.572451 0.240230 0.096105 -0.727754 0.020770 -0.744556 0.347854 0.245076 0.249070 0.247853 0.344743 0.344094
chargesum: 0.00000
title: Mulliken charges with hydrogens summed into heavy atoms:
elementType: Cl Cl N N N N C C C C C
charge: 0.030889 0.030746 0.006832 -0.083898 -0.075602 0.116387 0.240230 0.096105 -0.379900 0.020770 -0.002557
polarizability: 1.22273145e+02 -1.06521294e+01 1.06707316e+02 1.40029535e-01 2.05520212e-01 7.56829336e+01
1716.lowfreq: -9.3783 -8.3344 -0.9233 0.0013 0.0018 0.0024 24.9702 59.0826 80.9299
frequency: 24.7048 59.0778 80.9129 134.6859 175.0590 187.7302 200.8925 256.3776 294.6557 326.9908 452.5744 544.1443 547.8247 566.0126 577.2147 597.4801 650.8778 669.8871 711.5414 751.6711 828.9590 904.6921 921.5892 967.2710 1051.4625 1055.3898 1072.9576 1197.4286 1209.8173 1242.8494 1343.4022 1365.4059 1397.6085 1436.7187 1451.9855 1468.5399 1485.4525 1526.2788 1619.4656 3000.1784 3083.6163 3136.4488 3155.2616 3546.0174 3704.1284
redmass: 8.3217 1.0312 10.7676 6.8499 6.6829 4.5646 12.7243 11.0038 3.0418 7.5032 3.2848 1.2250 6.5884 1.0960 6.3354 4.1649 6.2030 5.8285 6.0583 10.1261 9.4666 11.8501 2.4564 3.8687 1.6673 2.3233 2.4430 2.4442 1.0661 1.8991 6.4498 2.7187 1.6001 1.8362 1.0876 2.8469 2.5787 2.9021 1.7991 1.0384 1.0952 1.1008 1.0891 1.0446 1.1059
irintensity: 0.0005 1.0642 0.3738 1.4936 0.7981 7.3237 2.3681 1.3064 5.8130 0.1418 7.8719 269.8162 11.3411 2.7461 19.4215 61.3349 18.3167 9.5712 45.6650 95.8797 1.6020 11.7211 0.3704 0.7505 9.4939 13.5144 1.2595 14.6122 10.1642 19.8993 4.6059 22.7900 78.9551 124.8519 29.9421 179.8386 114.5672 281.4890 490.2384 1.9150 7.3454 10.3252 0.4834 130.7985 57.3406
temp: 298.150 k
press: 1.00000 atm
elementType: 17 17 7 7 7 7 6 6 6 6 6 1 1 1 1 1 1
symmnumber: 1
zpe: 304947.5 jmol-1
zpe.correction: 0.116148 hartree
zpe.thermalcorrener: 0.127187 hartree
zpe.thermalcorrenthalpy: 0.128132 hartree
zpe.thermalcorrgfe: 0.077118 hartree
zpe.sumelectzpe: -1332.453581 hartree
zpe.sumelectthermal: -1332.442542 hartree
zpe.sumelectthermalent: -1332.441598 hartree
zpe.sumelectthermalfe: -1332.492612 hartree
dipole: 4.1945 -2.3061 0.0425
dipole: 4.7868
quadrupole: -72.6877 -67.2170 -79.8340
quadrupole: -4.1279 0.0812 0.0385
quadrupole: 0.5585 6.0292 -6.5877 -4.1279 0.0812 0.0385
hfenergy: -1332.5697296 hartree
pointgroup: C01 [X(C5H6Cl2N4)]
dipole: 1.661857 0.8858479 -0.0137538 debye
dipolederiv: -0.3736423 -0.0151126 0.2318465 -0.0717173 -0.1151135 0.1496235 0.195601 0.045493 -0.5810625 -0.372479 -0.016439 -0.2304108 -0.0725233 -0.1165337 -0.1530403 -0.1944222 -0.048765 -0.5807577 -1.0098121 0.3782509 0.0030524 0.4009073 -0.8967811 0.0013005 -0.0013438 0.0019722 -0.112375 -1.1758636 -0.5460246 0.0007351 -0.0371031 -0.6554025 0.0000939 -0.0014015 0.0017762 -0.2028368 -0.6049027 -0.0461227 -0.0033263 -0.4373673 -1.1763497 -0.0029702 0.0027023 0.0015701 -0.2262931 -0.8082991 -0.6968204 0.0014306 -0.7042863 -0.9359402 -0.0005633 0.0019371 0.0003218 -0.6797166 0.9267786 0.1274339 -0.0004553 -0.1843428 0.8037276 -0.0011873 0.0042111 -0.0054697 -0.0460695 0.9406205 -0.189914 -0.003411 -0.0903236 1.2026185 0.0109025 -0.0104019 0.0276513 0.0881902 0.6401231 0.0793032 -0.001482 0.1403717 0.2806271 0.003731 -0.001301 0.0039803 1.2377827 1.2460511 0.8112429 -0.001073 0.824661 1.3395471 0.0003841 -0.0020502 -0.0052344 0.2878024 0.0475977 0.0047693 0.0062957 0.1411686 -0.4325903 -0.0107267 0.0234423 -0.0639788 -0.0201877 0.0334079 -0.059232 0.0002576 0.0224316 -0.0047464 -0.0001041 -0.0001216 -0.0001348 -0.0364771 -0.0902477 0.0567114 -0.0257359 -0.0301777 0.0922101 -0.0028151 -0.0279641 0.0169367 0.1199163 0.0534881 -0.0067666 0.0871286 -0.0101208 0.068997 0.0553945 0.0555164 0.0969852 0.0174484 0.0877359 0.0215607 -0.0642722 0.0061431 0.0727133 -0.0511695 -0.0432429 -0.0736365 -0.0288937 0.279503 0.0764941 -0.0003055 0.0300794 0.1861623 0.0006753 -0.0004522 0.0003903 0.381738 0.1799405 0.0206656 -0.0002746 0.0721994 0.2868545 0.0004713 -0.0007089 0.0001421 0.3817917 unknown
polarizability: 122.5467488|10.446925|106.4327864|-0.0849503|0.2810493|75.6838594 unknown
InChI: InChI=1S/C5H6Cl2N4/c1-2-9-4(3(6)7)11-5(8)10-2/h3H,8H2,1H3
charge 0 multiplicity 1
17 atoms
Cl -2.94449 0.001656 1.53282
Cl -2.939649 -0.009215 -1.534897
N  -0.27458 -1.031084 0.006435
N  0.203119 1.351875 -0.000443
N  2.030845 -0.274443 0.006799
N  2.448703 2.036228 0.000051
C  -0.636544 0.282346 0.001304
C  1.082692 -1.258624 0.008879
C  -2.105292 0.645035 -0.001995
C  1.54427 1.014891 0.00152
C  1.544709 -2.687855 0.002348
H  -2.237851 1.732071 -0.006041
H  2.635902 -2.740248 0.127747
H  1.038232 -3.253407 0.803295
H  1.261813 -3.16905 -0.951938
H  3.442411 1.816927 0.002321
H  2.115511 2.997694 -0.002705
