program: Gaussian 09
title: 000035444
version: EM64L-G09RevD.01
frameworkgroup: C1[X(C17H17NO2)]
method: RPBEPBE
basis: SDD
operation: Freq
keyword: #p
keyword: freq=noraman
keyword: PBEPBE/SDD
title: #p freq=noraman PBEPBE/SDD
converged: YES YES NO NO
title: Mulliken charges:
elementType: O O N C C C C C C C C C C C C C C C C C H H H H H H H H H H H H H H H H H
charge: -0.442072 -0.254921 -0.266373 -0.435923 0.465094 -0.315816 0.145759 -0.344766 -0.368072 -0.367506 -0.226997 -0.238588 0.466777 -0.273512 -0.252751 -0.377095 -0.384190 -0.237655 -0.237931 -0.235228 0.262210 0.224188 0.225227 0.223752 0.281206 0.220846 0.271847 0.227472 0.224741 0.264411 0.230439 0.239155 0.237182 0.355992 0.230035 0.230718 0.232345
chargesum: 0.00000
title: Mulliken charges with hydrogens summed into heavy atoms:
elementType: O O N C C C C C C C C C C C C C C C C C
charge: -0.086080 -0.254921 -0.266373 0.050476 0.465094 0.133163 0.145759 -0.063560 -0.147226 -0.095659 0.000475 -0.013847 0.466777 -0.009101 -0.022312 -0.137940 -0.147008 -0.007620 -0.007212 -0.002882
polarizability: 4.00698587e+02 6.30120833e-01 1.79949850e+02 -3.07995870e+00 -1.13695997e+01 1.09596451e+02
1716.lowfreq: -8.6978 -3.4545 -0.0010 -0.0007 -0.0006 3.9804 26.1848 29.0177 30.4634
frequency: 26.0983 28.9776 30.4431 46.3111 61.0288 90.5057 93.7982 118.8890 137.7360 180.5787 220.3176 240.9379 256.8147 273.9914 307.3472 353.9497 390.8596 402.7963 403.1385 422.4143 444.7468 490.1615 502.8049 509.9688 556.8743 581.9231 614.8183 615.7370 645.9840 677.9714 688.7652 700.2442 742.1933 762.4744 774.0303 825.4351 828.1863 849.3953 854.8374 893.7436 900.2842 910.0439 929.6582 933.0637 964.2239 981.4293 984.5462 987.9530 988.2074 996.8371 1009.1675 1015.2451 1025.6073 1031.9185 1061.3467 1085.2241 1088.8612 1113.5386 1160.8217 1174.2034 1175.9704 1179.0949 1192.0047 1204.8078 1223.4654 1224.3691 1289.0208 1298.6222 1329.8895 1331.3457 1335.7696 1343.9687 1357.5775 1369.6950 1382.4860 1386.6020 1440.1453 1442.7044 1464.8407 1484.6174 1486.2467 1496.8462 1549.9846 1581.3187 1588.8642 1608.9738 1610.5183 1639.9510 2987.2910 3014.1537 3081.5552 3101.3756 3102.2622 3124.3598 3128.3777 3128.8513 3135.3218 3139.0692 3141.2722 3152.0332 3157.6343 3167.1530 3169.5052 3201.4610 3555.5731
redmass: 4.5383 5.3634 3.7802 5.2766 5.2882 6.3687 4.4660 3.0355 4.1614 4.9998 3.4386 4.6906 4.7743 2.8751 5.4780 1.4678 3.1790 2.7779 2.8726 2.9045 4.2849 2.9646 2.4907 3.1868 5.9399 3.9272 6.3445 6.2891 4.2250 4.2237 1.8755 1.7564 5.2021 1.8850 1.9526 1.2938 2.9165 1.2778 3.8081 1.6550 1.4814 2.2702 1.5663 2.5426 1.3805 1.3934 3.5762 1.5239 6.0000 1.3061 1.9851 1.6051 2.2126 2.3320 1.9941 1.6050 2.1439 2.3784 1.5770 1.0634 1.1134 1.7143 1.1212 1.1413 1.7737 1.8692 1.9480 1.6413 1.3457 1.2462 1.2762 1.7896 1.3574 1.2438 7.0269 6.8300 2.2931 2.4003 1.0885 2.1725 2.0969 1.1371 9.9763 5.6420 6.1845 5.9482 5.9778 5.5756 1.0650 1.0698 1.0986 1.0909 1.0927 1.0860 1.0878 1.0849 1.0907 1.0899 1.0915 1.0964 1.0937 1.1016 1.0985 1.0943 1.0660
irintensity: 0.7967 0.9531 0.0710 1.3252 1.6240 2.2320 1.3590 5.1452 3.9712 2.9369 0.5770 2.1605 3.2817 5.2964 14.3456 158.2432 47.5798 0.2644 0.5115 1.6599 8.8558 17.8986 19.0717 9.9789 16.8532 14.0466 0.3863 0.5787 6.3546 11.7809 43.4822 51.3581 6.1526 59.0497 65.4315 1.5748 18.3704 0.4065 4.2807 4.4127 8.3440 5.2954 4.5339 23.2010 0.2175 0.1000 0.7361 0.2900 3.2083 6.6023 25.4940 72.7819 2.0476 22.7855 122.8658 13.3645 1.7348 77.4390 275.1878 0.5001 11.0885 39.2476 7.8741 7.0235 4.4498 33.4132 20.7561 70.1296 15.1643 8.9297 23.7610 186.7174 46.3272 41.1670 1.8344 29.4579 21.0292 7.4585 4.9478 107.3056 40.4533 31.4738 146.4443 12.6707 10.7793 71.0374 8.5704 134.1288 40.9034 45.5716 25.5651 5.1067 12.4323 5.5891 3.2611 2.5855 16.9051 13.2466 4.3294 33.8440 40.7350 36.1532 21.0418 1.3733 4.0183
temp: 298.150 k
press: 1.00000 atm
elementType: 8 8 7 6 6 6 6 6 6 6 6 6 6 6 6 6 6 6 6 6 1 1 1 1 1 1 1 1 1 1 1 1 1 1 1 1 1
symmnumber: 1
zpe: 780541.6 jmol-1
zpe.correction: 0.297293 hartree
zpe.thermalcorrener: 0.315476 hartree
zpe.thermalcorrenthalpy: 0.316420 hartree
zpe.thermalcorrgfe: 0.248474 hartree
zpe.sumelectzpe: -861.758528 hartree
zpe.sumelectthermal: -861.740345 hartree
zpe.sumelectthermalent: -861.739401 hartree
zpe.sumelectthermalfe: -861.807347 hartree
dipole: -0.4395 2.4038 -0.6759
dipole: 2.5354
quadrupole: -92.8715 -119.4082 -118.8038
quadrupole: 6.2713 -0.1498 -7.6298
quadrupole: 17.4897 -9.0470 -8.4427 6.2713 -0.1498 -7.6298
hfenergy: -862.0558202 hartree
pointgroup: C01 [X(C17H17N1O2)]
dipole: -0.1666703 -0.9376892 0.2965623 debye
polarizability: 400.6568452|1.335208|179.1197955|4.545791|-13.6574891|110.4682478 unknown
InChI: InChI=1S/C17H17NO2/c19-14-13-18(16-9-5-2-6-10-16)17(20)12-11-15-7-3-1-4-8-15/h1-12,19H,13-14H2
charge 0 multiplicity 1
37 atoms
O  0.594612 -2.699884 -1.066135
O  0.619616 1.916868 0.096069
N  1.545417 -0.233494 0.402295
C  1.313153 -1.56191 1.029177
C  2.908797 0.175858 0.153136
C  1.544237 -2.735321 0.056474
C  0.44776 0.663056 0.214637
C  3.203549 1.190141 -0.803077
C  3.994525 -0.466981 0.809817
C  -0.907027 0.046936 0.115972
C  4.538799 1.542959 -1.080234
C  5.329196 -0.103585 0.524702
C  -3.41938 0.422421 0.03428
C  -2.019517 0.841787 0.186342
C  5.614803 0.903419 -0.4213
C  -3.806021 -0.916881 -0.270084
C  -4.443699 1.400485 0.19277
C  -5.164947 -1.25881 -0.405595
C  -5.80508 1.057584 0.058417
C  -6.171792 -0.274794 -0.241033
H  0.278143 -1.594142 1.399433
H  1.955628 -1.675296 1.921966
H  1.341516 -3.689111 0.571615
H  2.589892 -2.743368 -0.310892
H  2.391146 1.715502 -1.306216
H  3.821964 -1.246318 1.556882
H  -0.985885 -1.026574 -0.084449
H  4.736982 2.328268 -1.818225
H  6.144457 -0.613907 1.049796
H  -1.841373 1.91212 0.367728
H  6.650044 1.185172 -0.640482
H  -3.041672 -1.689786 -0.407875
H  -4.160443 2.434794 0.423387
H  0.805722 -1.91133 -1.629019
H  -5.44519 -2.291273 -0.642202
H  -6.576988 1.824528 0.184929
H  -7.228043 -0.545534 -0.347608
