program: Gaussian 09
title: 000000615
version: EM64L-G09RevD.01
frameworkgroup: C1[X(C5H11O8P)]
method: RPBEPBE
basis: SDD
operation: Freq
keyword: #p
keyword: freq=noraman
keyword: PBEPBE/SDD
title: #p freq=noraman PBEPBE/SDD
converged: YES YES NO NO
title: Mulliken charges:
elementType: P O O O O O O O O C C C C C H H H H H H H H H H H
charge: 1.384762 -0.461016 -0.484378 -0.509429 -0.484331 -0.294170 -0.669932 -0.699337 -0.578497 -0.184024 0.000078 0.290115 -0.381300 -0.384074 0.249136 0.210448 0.202803 0.261343 0.255022 0.316386 0.381011 0.378029 0.368664 0.425444 0.407247
chargesum: 0.00000
title: Mulliken charges with hydrogens summed into heavy atoms:
elementType: P O O O O O O O O C C C C C
charge: 1.384762 -0.080005 -0.106348 -0.509429 -0.115667 -0.294170 -0.244488 -0.292090 -0.578497 0.065112 0.210526 0.290115 0.082845 0.187334
polarizability: 1.40962618e+02 -1.52679095e-01 9.02685920e+01 -3.13511934e+00 -2.34096610e+00 8.31318586e+01
1716.lowfreq: -10.8693 -6.6362 -0.0019 -0.0017 -0.0013 5.6173 30.7524 32.4259 53.0916
frequency: 30.5289 32.1779 53.0733 76.0622 103.6510 109.0077 122.9581 145.1054 181.3151 198.5807 211.3765 240.1645 282.9082 287.6446 292.8773 310.1083 329.5064 353.8069 355.8709 365.4661 388.8380 431.9850 468.5658 527.0110 539.6832 592.0278 663.4124 673.7777 748.8530 766.3585 786.3212 792.0647 849.0198 930.9299 959.4530 969.5449 979.9168 992.0699 1035.7202 1060.2953 1065.4245 1073.7185 1139.7900 1172.8866 1185.5617 1218.1439 1223.8661 1237.6953 1246.5644 1301.7779 1332.8913 1334.4578 1350.2523 1372.0006 1398.0560 1423.0882 1469.3834 1603.9534 2942.0803 2957.5533 2980.9811 2984.8294 3067.7846 3072.4733 3100.3342 3452.6661 3496.5445 3605.3116 3621.3024
redmass: 7.4981 6.6652 4.7935 5.3550 3.5423 7.3974 1.7713 3.4076 5.1621 5.4191 4.0975 5.7879 1.1942 6.1196 5.2604 4.2981 5.9449 2.3270 3.9126 4.2906 3.0147 3.2828 2.9859 1.8614 1.6207 7.9496 5.2844 6.2454 1.3746 3.3121 6.9621 4.1879 3.0592 3.1220 2.0084 6.8590 1.7180 2.2534 2.2655 3.4624 2.4158 5.3525 2.1568 1.2504 1.1241 1.4102 1.1867 1.3580 1.1462 1.2939 1.2436 1.4032 1.2762 1.4000 1.5736 1.0759 1.0791 8.6949 1.0814 1.0827 1.0623 1.0594 1.1047 1.0980 1.0679 1.0646 1.0647 1.0670 1.0666
irintensity: 2.1405 1.0675 1.2524 0.4370 2.7856 9.0898 84.0047 39.0961 0.7797 11.7511 15.9196 15.3046 119.0946 6.5598 26.3432 2.2847 45.2841 60.8848 34.3414 28.2560 22.7595 16.5055 50.3246 47.5611 137.6768 22.9352 63.8495 57.8233 142.4602 67.5003 244.5770 37.8857 16.3007 74.4229 10.9428 43.7389 33.7051 184.2093 40.0670 47.0688 33.2908 158.8366 17.3053 23.0763 61.5927 88.1821 98.7481 180.1288 41.6448 10.3941 81.4910 23.6402 11.9296 27.3634 9.5286 28.7737 8.4940 99.5607 11.6338 57.1296 16.3547 45.3978 23.5476 9.7312 784.6840 43.1498 48.5997 15.2833 72.2867
temp: 298.150 k
press: 1.00000 atm
elementType: 15 8 8 8 8 8 8 8 8 6 6 6 6 6 1 1 1 1 1 1 1 1 1 1 1
symmnumber: 1
zpe: 464566.2 jmol-1
zpe.correction: 0.176944 hartree
zpe.thermalcorrener: 0.193870 hartree
zpe.thermalcorrenthalpy: 0.194814 hartree
zpe.thermalcorrgfe: 0.131399 hartree
zpe.sumelectzpe: -1138.968091 hartree
zpe.sumelectthermal: -1138.951165 hartree
zpe.sumelectthermalent: -1138.950221 hartree
zpe.sumelectthermalfe: -1139.013636 hartree
dipole: -8.4428 -1.8865 -0.2735
dipole: 8.6553
quadrupole: -96.4570 -91.0962 -86.3900
quadrupole: -2.3293 -7.3452 5.4352
quadrupole: -5.1426 0.2182 4.9244 -2.3293 -7.3452 5.4352
hfenergy: -1139.1450354 hartree
pointgroup: C01 [X(C5H11O8P1)]
dipole: -3.2537035 -0.9734385 0.2484439 debye
dipolederiv: 2.3813498 0.0043542 0.093135 -0.42135 1.9346182 -0.0911158 -0.0818651 -0.1302296 1.6649462 -0.4752691 -0.002282 -0.166095 -0.0416362 -0.6054272 0.1400449 -0.1478732 0.1469096 -0.6214647 -0.5806048 0.1193558 -0.0173233 0.0752215 -0.653081 -0.1266309 -0.0893237 -0.1381476 -0.518692 -1.5625154 0.1096761 0.1111999 0.0290266 -0.4411096 -0.0090972 0.1877107 0.0706963 -0.5551297 -0.50695 -0.2230908 0.1912819 -0.2957263 -0.7333058 -0.0099239 0.1983857 0.0148098 -0.492381 -1.0004778 -0.036106 0.1422419 0.0207244 -0.3456086 0.1606819 0.3010262 0.2214872 -0.7152961 -1.0291117 0.1038309 -0.2188011 0.1459943 -0.7201583 0.100207 -0.155343 0.1411027 -0.8716803 -0.5896618 -0.1572703 -0.1367074 0.0415937 -1.1489694 0.0042091 -0.0919382 -0.0000436 -0.6242959 -0.7280502 -0.0379616 -0.0160002 0.033993 -0.6041667 0.02457 -0.0156543 -0.0095205 -0.5422997 -0.2284531 -0.0545736 0.1268376 0.0569069 0.3291028 -0.0859391 0.3046587 -0.0748696 0.4890435 0.2342103 -0.1022697 0.0128305 0.0870247 0.4336401 0.1585713 -0.1030151 0.1153571 0.4184508 0.9901751 0.0353744 -0.1298867 -0.1028169 0.2646696 -0.205468 -0.2047912 -0.2379937 0.6522082 0.31723 0.2431431 -0.1028418 0.1448892 0.5203586 0.0046236 -0.080174 0.0014708 0.2760966 0.7032115 0.0428167 -0.1025903 0.3688085 0.0634954 0.1260873 -0.0078514 0.0646038 0.0199936 0.0602661 0.0305241 0.0025729 -0.01602 0.0036266 -0.0745362 -0.0493028 -0.059791 -0.0853389 0.0275296 0.0131389 -0.0533222 0.0363497 -0.0097895 -0.0016446 -0.0413956 -0.0362749 -0.2022806 -0.0006608 0.0616162 0.0701706 0.0342216 -0.1058734 -0.0686104 0.0899652 -0.1065849 -0.0130391 0.0852683 -0.0016855 -0.0270037 -0.0146361 0.0126176 0.0142717 -0.0697788 0.0450884 -0.0726437 -0.0918548 0.0401618 0.0981134 0.0147627 0.1180496 -0.0563038 0.0777228 -0.0213877 0.0246987 0.1119123 -0.0041609 -0.0244929 -0.1115572 0.0676216 -0.0137231 -0.0330275 -0.0113675 0.1096676 0.3380698 -0.0361565 0.1597188 -0.0025767 0.3458753 -0.0257198 0.0902003 -0.0257688 0.3034649 0.3500212 -0.1021044 0.027828 -0.0857126 0.2575358 0.008281 0.0497005 0.023681 0.3231477 0.1041239 -0.0057809 -0.1100748 0.0335144 0.2989544 0.0353396 -0.1169893 0.0193468 0.3394909 0.8960741 -0.0642288 -0.0049273 -0.0837536 0.3797158 0.0164707 -0.0989775 0.0122771 0.3234144 0.1941676 0.0236789 0.0741364 0.0527543 0.3376083 -0.0246452 0.0879308 -0.0248512 0.3699183 unknown
polarizability: 140.8876465|2.8740753|86.6941883|-2.0019337|-4.4564149|86.781234 unknown
InChI: InChI=1S/C5H11O8P/c6-1-3(7)5(9)4(8)2-13-14(10,11)12/h3,5-7,9-11H,1-2H2
charge 0 multiplicity 1
25 atoms
P  3.362505 -0.186276 0.232616
O  -2.172081 1.225698 -1.132779
O  -1.581427 -1.646847 -0.150581
O  2.088721 0.515966 1.198361
O  -4.127276 -1.996945 0.647211
O  0.460109 0.914633 -1.117969
O  3.096177 0.429133 -1.324402
O  2.756234 -1.811112 0.216347
O  4.815392 0.018433 0.803303
C  -1.600394 0.763166 0.113193
C  -2.237988 -0.566682 0.588375
C  -0.079532 0.592292 -0.019196
C  -3.752559 -0.59978 0.343117
C  0.711438 0.029122 1.154123
H  -1.782991 1.536974 0.891115
H  -2.050756 -0.69005 1.678361
H  -4.273098 0.109974 1.016502
H  -3.960599 -0.340464 -0.710728
H  0.264729 0.339073 2.114346
H  0.66474 -1.077427 1.076084
H  -1.442016 1.24822 -1.812717
H  -2.189864 -2.433149 -0.099867
H  -5.037873 -2.186513 0.314154
H  2.124681 0.699494 -1.468292
H  3.391628 -2.502431 -0.094276
