program: Gaussian 09
title: 000000614
version: EM64L-G09RevD.01
frameworkgroup: C1[X(C5H9NO2)]
method: RPBEPBE
basis: SDD
operation: Freq
keyword: #pfreq=noraman
keyword: PBEPBE/SDD
title: #p freq=noraman PBEPBE/SDD
converged: YES YES NO NO
title: Mulliken charges:
elementType: O O N C C C C C H H H H H H H H H
charge: -0.412956 -0.237560 -0.325757 -0.171133 -0.451677 -0.442032 -0.400449 0.143998 0.270121 0.249941 0.230831 0.230678 0.222711 0.215736 0.215248 0.284314 0.377986
chargesum: 0.00000
title: Mulliken charges with hydrogens summed into heavy atoms:
elementType: O O N C C C C C
charge: -0.034971 -0.237560 -0.041443 0.098988 0.029095 0.011357 0.030535 0.143998
polarizability: 7.27849468e+01 2.22847366e+00 6.42426128e+01 -5.29744323e-01 3.38616060e+00 5.26298846e+01
1716.lowfreq: -13.9623 -0.0003 -0.0003 0.0004 5.0103 20.9352 46.0355 54.9713 162.1558
frequency: 45.3000 54.4335 162.0953 222.5269 296.8673 404.5807 516.8799 536.9287 568.6686 622.9223 668.9743 746.2503 800.1768 866.4200 896.6212 914.9738 945.7748 952.2755 1032.8547 1058.0178 1095.6225 1129.4338 1154.6244 1184.7535 1208.5426 1249.2806 1258.4222 1293.7206 1308.4249 1327.4702 1343.7267 1427.2634 1467.3064 1475.5812 1499.5509 1648.7373 2970.2526 2982.1809 3004.5398 3025.8181 3030.6975 3079.5796 3103.9959 3493.5009 3507.8651
redmass: 2.4887 6.8074 2.3967 3.3674 2.3200 4.4206 2.6695 1.8873 2.8835 1.6563 2.5539 2.4195 3.5343 1.8828 1.6157 2.8323 2.0655 2.4132 2.7190 1.6109 1.7978 1.4255 2.7603 1.7044 1.2975 1.3161 1.5626 1.3712 1.2676 1.4756 1.3741 1.2735 1.0852 1.0957 1.0859 8.8500 1.0634 1.0823 1.0676 1.0656 1.0961 1.1016 1.1036 1.0755 1.0642
irintensity: 4.1375 0.8067 3.0638 11.9457 13.8491 25.6098 76.8783 10.5607 13.8189 168.2332 50.3638 14.5633 7.3615 2.1719 13.2886 2.0667 3.4321 11.5974 262.7941 4.2500 24.5707 0.9504 11.8889 12.4468 0.8233 6.2884 15.3080 4.2751 0.6916 18.7106 2.0920 18.1785 9.9406 8.9985 1.2000 206.9788 108.3168 16.2418 17.3614 42.5013 28.1848 42.0533 26.2835 7.0748 14.7175
temp: 298.150 k
press: 1.00000 atm
elementType: 8 8 7 6 6 6 6 6 1 1 1 1 1 1 1 1 1
symmnumber: 1
zpe: 368356.7 jmol-1
zpe.correction: 0.140300 hartree
zpe.thermalcorrener: 0.148230 hartree
zpe.thermalcorrenthalpy: 0.149174 hartree
zpe.thermalcorrgfe: 0.106895 hartree
zpe.sumelectzpe: -400.488247 hartree
zpe.sumelectthermal: -400.480317 hartree
zpe.sumelectthermalent: -400.479372 hartree
zpe.sumelectthermalfe: -400.521652 hartree
dipole: 0.1255 1.4816 -0.6936
dipole: 1.6407
quadrupole: -42.3504 -50.2022 -49.7879
quadrupole: 1.1744 1.3879 -1.1874
quadrupole: 5.0964 -2.7554 -2.3411 1.1744 1.3879 -1.1874
hfenergy: -400.6285466 hartree
pointgroup: C01[X(C5H9N1O2)]
dipole: -0.015356 0.564662 0.3123695 debye
dipolederiv: -0.8830113 0.5088551 -0.0277394 0.4607748 -0.7390428 -0.0748542 0.0433461 -0.1283431 -0.348526 -0.603503 -0.1135935 0.150179 0.0910986 -0.879969 0.1618479 0.1320239 0.2998657 -0.4359131 -0.6140631 0.0711028 0.0331927 0.1358648 -0.3830051 -0.1044438 -0.010865 -0.2172699 -0.5920859 0.2279265 -0.2269512 0.0021174 -0.4607604 0.1818344 0.0599951 0.0655654 0.0377243 0.2109498 0.0970701 0.0457284 -0.0424537 0.0953594 0.0615166 -0.0392156 0.0216184 -0.0185443 0.0776492 0.0306344 0.0743401 -0.0696592 0.0423153 -0.0256436 -0.0585852 -0.0540499 -0.0140151 0.0433646 0.5964863 0.0093313 0.0627494 0.1332338 0.1583394 -0.0151151 0.0746778 -0.0224413 0.2552922 1.1285615 -0.2304708 -0.2681625 -0.3472944 1.227318 -0.2608687 -0.3549802 -0.342384 0.365925 -0.0675678 0.0570992 -0.0619708 0.0694923 0.03681 0.0476885 -0.0988822 0.057395 -0.0611002 0.0252956 0.1145926 0.0383227 0.0813461 -0.015986 -0.0486338 0.0413761 -0.0684665 0.0437096 -0.0172722 -0.0889135 0.0654972 -0.0628385 0.0183252 0.0750945 0.0434578 0.0994381 -0.0587162 -0.0946667 -0.1170571 -0.0750332 -0.1087494 0.0195299 -0.0517223 -0.0556384 -0.0410288 0.0633361 0.024856 -0.000784 0.1175072 -0.0037665 0.034831 0.0556715 0.0738698 0.031224 -0.1093196 -0.2194456 -0.0114443 0.0724354 -0.0804172 0.0490785 0.0081564 0.1191923 -0.0033711 -0.0317799 0.0079057 0.020354 -0.0439805 0.0853492 -0.0982613 0.108755 -0.0825024 0.1172795 -0.0173871 0.1379267 -0.0675681 -0.0619322 -0.0300877 0.1027151 0.0338299 -0.0826349 0.1341585 0.3113527 0.2228669 -0.0446211 0.1089303 -0.1009203 0.2516095 0.1023999 0.1244255 0.078779 0.2832489 unknown
polarizability: 72.4609871|-2.5132469|64.6953207|-2.3997291|-2.3972312|52.5011365 unknown
InChI: InChI=1S/C5H9NO2/c7-5(8)4-2-1-3-6-4/h4,6-7H,1-3H2
charge 0 multiplicity 1
17 atoms
O  -2.201723 0.863659 0.150531
O  -1.435322 -1.277001 0.624128
N  0.896164 -0.879634 -0.989348
C  -0.074106 0.218952 -0.832501
C  0.762223 1.381755 -0.215445
C  1.767868 0.633453 0.694632
C  2.10078 -0.638241 -0.132169
C  -1.262579 -0.173387 0.059695
H  -0.509767 0.538463 -1.799976
H  0.13145 2.112985 0.314142
H  1.294171 1.903943 -1.030714
H  2.662793 1.237261 0.921711
H  1.28573 0.360073 1.651725
H  2.991995 -0.464223 -0.766708
H  2.314351 -1.509191 0.515942
H  0.477324 -1.809084 -0.874186
H  -2.972952 0.564616 0.704942
