program: Gaussian 09
title: 000035357
version: EM64L-G09RevD.01
frameworkgroup: C1[X(C9H8O4)]
method: RPBEPBE
basis: SDD
operation: Freq
keyword: #p
keyword: freq=noraman
keyword: PBEPBE/SDD
title: #p freq=noraman PBEPBE/SDD
converged: YES YES NO NO
title: Mulliken charges:
elementType: O O O O C C C C C C C C C H H H H H H H H
charge: -0.398709 -0.437099 -0.220768 -0.240628 0.335705 0.159829 0.134061 -0.412953 -0.340560 -0.809798 -0.208933 0.053097 0.122031 0.242383 0.281281 0.267117 0.226286 0.239236 0.237939 0.382714 0.387770
chargesum: 0.00000
title: Mulliken charges with hydrogens summed into heavy atoms:
elementType: O O O O C C C C C C C C C
charge: -0.015995 -0.049329 -0.220768 -0.240628 0.335705 0.159829 0.134061 -0.170569 -0.059279 -0.077160 0.029006 0.053097 0.122031
polarizability: 1.34325194e+02 2.57467713e+00 1.32923530e+02 -2.31858119e+00 3.16636951e+00 5.94758612e+01
1716.lowfreq: -5.7108 -1.9035 0.0003 0.0007 0.0007 6.8788 27.2805 78.0048 110.5810
frequency: 27.2775 78.0027 110.5807 127.3662 153.5127 163.1915 199.6522 209.1690 301.9475 338.7954 361.7751 409.7088 465.7694 489.3868 528.2760 571.3143 585.3717 593.7543 601.5565 653.5830 697.4022 712.7787 771.2890 775.0394 819.5288 883.8156 934.2171 996.8700 999.6132 1005.4217 1052.4309 1065.8506 1088.9177 1156.1098 1176.6832 1198.6691 1259.8129 1303.6878 1326.7287 1374.9080 1404.1774 1442.1644 1452.0642 1467.5529 1483.8819 1588.8087 1597.6440 1639.7765 1649.4719 2986.9412 3068.5790 3097.0943 3132.1686 3156.3469 3185.9913 3509.7610 3531.3738
redmass: 10.2156 4.3992 9.3171 1.0706 6.1059 6.2541 4.5754 3.1735 7.6216 4.4318 5.1900 4.7502 3.4657 3.9377 2.9977 2.3501 2.3621 2.9629 1.4489 4.2579 4.8416 5.4466 2.9803 3.3556 2.0674 5.1357 1.3708 2.1011 1.4014 3.3301 1.5791 2.4565 1.8778 1.9746 1.2715 1.7811 1.8911 2.5713 2.7930 8.3990 1.2357 2.3834 2.9230 1.0598 1.2114 7.5916 6.1656 8.7272 9.5021 1.0376 1.0970 1.0998 1.0883 1.0939 1.0962 1.0638 1.0642
irintensity: 0.6435 0.7649 1.7029 0.3957 4.3613 3.0529 1.9575 2.0069 2.2307 7.0312 2.3407 4.6504 2.2273 6.1128 31.7751 28.7969 25.8917 125.1109 93.5344 27.8818 36.8388 63.2973 29.3815 26.5532 14.6510 25.2544 0.5741 56.4795 17.1406 172.9868 15.8924 266.8117 31.5680 61.3625 19.5332 15.0639 1.8191 52.0319 95.5313 4.4764 21.1615 32.4011 26.8510 14.4458 13.2824 13.4019 22.9917 246.4754 199.9947 15.9704 9.8903 15.7606 7.7032 17.3021 4.4070 31.8773 51.4323
temp: 298.150 k
press: 1.00000 atm
elementType: 8 8 8 8 6 6 6 6 6 6 6 6 6 1 1 1 1 1 1 1 1
symmnumber: 1
zpe: 400531.1 jmol-1
zpe.correction: 0.152554 hartree
zpe.thermalcorrener: 0.164646 hartree
zpe.thermalcorrenthalpy: 0.165590 hartree
zpe.thermalcorrgfe: 0.113637 hartree
zpe.sumelectzpe: -647.734992 hartree
zpe.sumelectthermal: -647.722901 hartree
zpe.sumelectthermalent: -647.721956 hartree
zpe.sumelectthermalfe: -647.773909 hartree
dipole: 0.5052 2.4873 1.4119
dipole: 2.9044
quadrupole: -60.5038 -69.0534 -80.4835
quadrupole: 1.2279 1.1725 -6.8850
quadrupole: 9.5097 0.9602 -10.4699 1.2279 1.1725 -6.8850
hfenergy: -647.8875462 hartree
pointgroup: C01 [X(C9H8O4)]
dipole: -0.4295821 -0.9283562 0.5092193 debye
dipolederiv: -0.4459127 -0.0096451 -0.2202863 -0.0499323 -0.4548422 -0.3492212 -0.1980923 -0.3889264 -1.0111371 -0.9365878 0.5189365 -0.1133115 0.6023937 -0.7478969 0.0786876 -0.1445673 0.0733884 -0.4382006 -0.3785407 -0.0089252 -0.0934693 0.042341 -0.8401253 0.3064462 -0.1445549 0.0313651 -0.77178 -0.8685808 -0.1836666 0.0443239 -0.1297485 -0.8927454 0.1006919 0.0063161 0.0915645 -0.3139283 0.1347423 -0.2696832 0.0066438 -0.3781556 0.0586628 -0.0115781 0.0356265 0.0106769 -0.0048723 0.057623 0.1431533 -0.0275816 -0.1333475 -0.2023273 -0.0130519 0.0072681 0.0367608 -0.0972366 -0.6285871 -0.1439736 -0.020274 -0.1475256 0.033841 0.0299513 -0.0180873 -0.0433372 0.0237438 0.0692062 0.0125571 0.0128886 0.1822387 -0.0208082 0.0092542 0.004201 -0.0059629 -0.142427 0.040367 -0.099546 0.0050412 0.0939744 -0.0934892 0.0000185 -0.015409 -0.0257488 -0.1219402 -0.0021827 0.09913 -0.0083887 0.1729646 -0.1196085 0.013183 -0.0296045 0.0237862 0.0211265 -0.1018682 0.1431833 0.0059538 0.0763747 0.1279006 0.0028886 -0.002523 0.0060571 -0.1346588 0.5158537 0.0846187 0.348027 0.1249307 1.3091137 -0.0075503 0.3290191 0.24481 1.4538501 1.8887507 -0.0777683 0.0672828 -0.1476053 1.3263726 -0.228011 0.096075 -0.1845614 0.2794267 -0.0994702 -0.0552409 -0.0108205 -0.0245567 0.079887 -0.0031924 -0.0080314 -0.001297 0.1490076 0.0674107 0.064881 -0.0005023 0.059588 0.0434864 -0.0016956 0.0142899 0.0100429 0.1627471 0.0774507 0.0148762 0.0441339 0.0403564 0.0477337 0.0791136 -0.0058158 0.0847516 -0.0023288 -0.106979 -0.0368119 0.0020269 -0.1465378 0.0360627 -0.0019049 0.0078713 -0.0039677 0.1160052 0.0617908 0.0148506 -0.0469557 0.0361226 0.0117923 -0.0933529 0.008483 -0.1139674 -0.0232113 0.0667949 -0.0484734 -0.0017917 -0.0544597 -0.0991591 -0.0041458 -0.00143 -0.0033476 0.1562843 0.3338764 -0.0599145 -0.010002 -0.046819 0.1482863 0.069587 0.0139633 0.1355298 0.3076085 0.2548429 -0.1025381 0.017062 -0.1725967 0.2478631 0.0238821 0.0450023 0.0223829 0.3919213 unknown
polarizability: 135.0086996|2.0671247|132.0524032|5.2833782|-1.4266219|59.6634823 unknown
InChI: InChI=1S/C9H8O4/c1-5-3-2-4-6(8(10)11)7(5)9(12)13/h2-4,10,12H,1H3
charge 0 multiplicity 1
21 atoms
O  0.359962 2.135205 1.349409
O  2.871272 -1.423268 0.243198
O  -0.233568 2.572271 -0.855751
O  2.464394 0.819786 -0.181354
C  -1.801573 -0.063598 -0.036741
C  -0.424596 0.290063 0.029966
C  0.578222 -0.721469 0.044702
C  -2.141525 -1.439608 -0.064103
C  0.209465 -2.08969 0.019015
C  -2.886559 0.997026 -0.072786
C  -1.151216 -2.445784 -0.031457
C  -0.07033 1.754511 0.074831
C  2.015102 -0.333511 0.024442
H  -3.200184 -1.719808 -0.109102
H  0.995044 -2.848961 0.030731
H  -2.803078 1.616728 -0.983474
H  -3.888321 0.537148 -0.054144
H  -2.81099 1.684603 0.790132
H  -1.441836 -3.501158 -0.052366
H  0.646133 3.089036 1.325075
H  3.81158 -1.102422 0.197177
